Iron, di-μ-carbonyldicarbonylbis(η5-2,4-cyclopentadien-1-yl)di-, (Fe-Fe), trans-

Gas phase ion energetics data

Data compiled by: Sharon G. Lias, Rhoda D. Levin, and Sherif A. Kafafi

Ionization energy determinations

IE (eV) Method Reference Comment
6.95PEGranozzi, Tondello, et al., 1980Vertical value

References

Granozzi, Tondello, et al., 1980
Granozzi, G.; Tondello, E.; Benard, M.; Fragala, I., Electronic structure of trans-[η5-C5H5Fe(CO)2]2 by He(I) and He(II) photoelectron spectroscopy ab initio calculations, J. Organomet. Chem., 1980, 194, 83. [all data]