HOSO2

Reaction thermochemistry data

Data compiled by: Michael M. Meot-Ner (Mautner) and Sharon G. Lias

Individual Reactions

(HO4S- • 2Sulfuric Acid) + HO3S = (HO4S- • HO3S • 2Sulfuric Acid)

By formula: (HO4S- • 2H2O4S) + HO3S = (HO4S- • HO3S • 2H2O4S)

Quantity Value Units Method Reference Comment
Δr21.0kcal/molATMArnold and Qiu, 1984gas phase; Entropy change calculated or estimated
Δr18.kcal/molATMArnold, Viggiano, et al., 1982gas phase; Entropy change calculated or estimated, DG>, ΔrH>
Quantity Value Units Method Reference Comment
Δr25.cal/mol*KN/AArnold and Qiu, 1984gas phase; Entropy change calculated or estimated
Δr25.cal/mol*KN/AArnold, Viggiano, et al., 1982gas phase; Entropy change calculated or estimated, DG>, ΔrH>

Free energy of reaction

ΔrG° (kcal/mol) T (K) Method Reference Comment
14.8250.ATMArnold and Qiu, 1984gas phase; Entropy change calculated or estimated
12.233.ATMArnold, Viggiano, et al., 1982gas phase; Entropy change calculated or estimated, DG>, ΔrH>

HO4S- + HO3S = (HO4S- • HO3S)

By formula: HO4S- + HO3S = (HO4S- • HO3S)

Quantity Value Units Method Reference Comment
Δr22.4kcal/molATMArnold and Qiu, 1984gas phase; Entropy change calculated or estimated, DG>, ΔrH>
Quantity Value Units Method Reference Comment
Δr25.cal/mol*KN/AArnold and Qiu, 1984gas phase; Entropy change calculated or estimated, DG>, ΔrH>

Free energy of reaction

ΔrG° (kcal/mol) T (K) Method Reference Comment
16.2250.ATMArnold and Qiu, 1984gas phase; Entropy change calculated or estimated, DG>, ΔrH>

(H2O4S- • Sulfuric Acid) + HO3S = (H2O4S- • HO3S • Sulfuric Acid)

By formula: (H2O4S- • H2O4S) + HO3S = (H2O4S- • HO3S • H2O4S)

Quantity Value Units Method Reference Comment
Δr22.1kcal/molATMArnold and Qiu, 1984gas phase; Entropy change calculated or estimated
Quantity Value Units Method Reference Comment
Δr25.cal/mol*KN/AArnold and Qiu, 1984gas phase; Entropy change calculated or estimated

Free energy of reaction

ΔrG° (kcal/mol) T (K) Method Reference Comment
15.9250.ATMArnold and Qiu, 1984gas phase; Entropy change calculated or estimated

(HO4S- • Nitric acid) + HO3S = (HO4S- • HO3S • Nitric acid)

By formula: (HO4S- • HNO3) + HO3S = (HO4S- • HO3S • HNO3)

Quantity Value Units Method Reference Comment
Δr21.7kcal/molATMArnold and Qiu, 1984gas phase; Entropy change calculated or estimated
Quantity Value Units Method Reference Comment
Δr25.cal/mol*KN/AArnold and Qiu, 1984gas phase; Entropy change calculated or estimated

Free energy of reaction

ΔrG° (kcal/mol) T (K) Method Reference Comment
15.5250.ATMArnold and Qiu, 1984gas phase; Entropy change calculated or estimated

Ion clustering data

Data compiled by: Michael M. Meot-Ner (Mautner) and Sharon G. Lias

Clustering reactions

(HO4S- • Nitric acid) + HO3S = (HO4S- • HO3S • Nitric acid)

By formula: (HO4S- • HNO3) + HO3S = (HO4S- • HO3S • HNO3)

Quantity Value Units Method Reference Comment
Δr21.7kcal/molATMArnold and Qiu, 1984gas phase; Entropy change calculated or estimated
Quantity Value Units Method Reference Comment
Δr25.cal/mol*KN/AArnold and Qiu, 1984gas phase; Entropy change calculated or estimated

Free energy of reaction

ΔrG° (kcal/mol) T (K) Method Reference Comment
15.5250.ATMArnold and Qiu, 1984gas phase; Entropy change calculated or estimated

HO4S- + HO3S = (HO4S- • HO3S)

By formula: HO4S- + HO3S = (HO4S- • HO3S)

Quantity Value Units Method Reference Comment
Δr22.4kcal/molATMArnold and Qiu, 1984gas phase; Entropy change calculated or estimated, DG>, ΔrH>
Quantity Value Units Method Reference Comment
Δr25.cal/mol*KN/AArnold and Qiu, 1984gas phase; Entropy change calculated or estimated, DG>, ΔrH>

Free energy of reaction

ΔrG° (kcal/mol) T (K) Method Reference Comment
16.2250.ATMArnold and Qiu, 1984gas phase; Entropy change calculated or estimated, DG>, ΔrH>

(HO4S- • 2Sulfuric Acid) + HO3S = (HO4S- • HO3S • 2Sulfuric Acid)

By formula: (HO4S- • 2H2O4S) + HO3S = (HO4S- • HO3S • 2H2O4S)

Quantity Value Units Method Reference Comment
Δr21.0kcal/molATMArnold and Qiu, 1984gas phase; Entropy change calculated or estimated
Δr18.kcal/molATMArnold, Viggiano, et al., 1982gas phase; Entropy change calculated or estimated, DG>, ΔrH>
Quantity Value Units Method Reference Comment
Δr25.cal/mol*KN/AArnold and Qiu, 1984gas phase; Entropy change calculated or estimated
Δr25.cal/mol*KN/AArnold, Viggiano, et al., 1982gas phase; Entropy change calculated or estimated, DG>, ΔrH>

Free energy of reaction

ΔrG° (kcal/mol) T (K) Method Reference Comment
14.8250.ATMArnold and Qiu, 1984gas phase; Entropy change calculated or estimated
12.233.ATMArnold, Viggiano, et al., 1982gas phase; Entropy change calculated or estimated, DG>, ΔrH>

(H2O4S- • Sulfuric Acid) + HO3S = (H2O4S- • HO3S • Sulfuric Acid)

By formula: (H2O4S- • H2O4S) + HO3S = (H2O4S- • HO3S • H2O4S)

Quantity Value Units Method Reference Comment
Δr22.1kcal/molATMArnold and Qiu, 1984gas phase; Entropy change calculated or estimated
Quantity Value Units Method Reference Comment
Δr25.cal/mol*KN/AArnold and Qiu, 1984gas phase; Entropy change calculated or estimated

Free energy of reaction

ΔrG° (kcal/mol) T (K) Method Reference Comment
15.9250.ATMArnold and Qiu, 1984gas phase; Entropy change calculated or estimated

References

Arnold and Qiu, 1984
Arnold, F.; Qiu, S., Upper Stratosphere Negative Ion Composition Measurements and Infrared Trace Gas Abundances, Planet. Space Sci., 1984, 32, 2, 169, https://doi.org/10.1016/0032-0633(84)90151-X . [all data]

Arnold, Viggiano, et al., 1982
Arnold, F.; Viggiano, A.A.; Schlager, H., Implications for Trace Gases and Aerosols of Large Negative Ions Clusters in the Stratosphere, Nature, 1982, 297, 5865, 371, https://doi.org/10.1038/297371a0 . [all data]