2-Methoxy-9,10-anthraquinone

Phase change data

Data compiled by: William E. Acree, Jr., James S. Chickos

Enthalpy of sublimation

ΔsubH (kJ/mol) Temperature (K) Method Reference
118.4 ± 0.4419.HSABeynon and Nicholson, 2002

References

Beynon and Nicholson, 2002
Beynon, J.H.; Nicholson, G.R., A radioactive ionization gauge and its application to the measurement of latent heat of vaporization, J. Sci. Instrum., 2002, 33, 10, 376-380, https://doi.org/10.1088/0950-7671/33/10/302 . [all data]

(editor), 1978
(editor), Koptyug V.A., Atlas of Spectra of Aromatic and Heterocyclic Compounds, 1978, 16, 100. [all data]