1-(2-Furyl)-4,4,4-trifluoro-1,3-butanedione

Phase change data

Data compiled by: William E. Acree, Jr., James S. Chickos

Quantity Value Units Method Reference Comment
Δsub70. ± 10.kJ/molN/ARibeiro da Silva, Gonçalves, et al., 1997

References

Ribeiro da Silva, Gonçalves, et al., 1997
Ribeiro da Silva, Manuel A.V.; Gonçalves, J.M.; Pilcher, G., Standard molar enthalpies of formation of nine fluorinated β-diketones by rotating bomb calorimetry, The Journal of Chemical Thermodynamics, 1997, 29, 3, 253-260, https://doi.org/10.1006/jcht.1996.0143 . [all data]