Methional

Van Den Dool and Kratz RI, non-polar column, temperature ramp

Data compiled by: NIST Mass Spectrometry Data Center, William E. Wallace, director

Column type CapillaryCapillaryCapillaryCapillaryCapillary
Active phase DB-5MSDB-5MSSPB-5HP-5MSDB-5MS
Column length (m) 30.30.60.30.30.
Carrier gas HeHe HeHe
Substrate
Column diameter (mm) 0.250.250.320.250.25
Phase thickness (μm) 0.250.251.0.50.25
Tstart (C) 40.40.40.35.35.
Tend (C) 200.200.230.225.225.
Heat rate (K/min) 4.4.3.4.10.
Initial hold (min) 1.1.2.5.5.
Final hold (min) 10.10.10.30.25.
I 903.914.904.906.912.
ReferenceCho, Namgung, et al., 2008Cho I.H., Lee S.M., et al., 2007Engel and Ratel, 2007Jarunrattanasri, Theerakulkait, et al., 2007Lozano P.R., Drake M., et al., 2007
Comment MSDC-RI MSDC-RI MSDC-RI MSDC-RI MSDC-RI
Column type CapillaryCapillaryCapillaryCapillaryCapillary
Active phase DB-5MSDB-5DB-5DB-1DB-1
Column length (m) 30.30.60.20.20.
Carrier gas HeHe
Substrate
Column diameter (mm) 0.250.320.320.180.18
Phase thickness (μm) 0.250.51.0.180.18
Tstart (C) 35.40.40.60.60.
Tend (C) 225.265.260.220.220.
Heat rate (K/min) 10.7.4.8.8.
Initial hold (min) 5. 2.3.3.
Final hold (min) 25.5.10.5.5.
I 903.894.910.861.863.
ReferenceLozano P.R., Drake M., et al., 2007Mahattanatawee K., Perez-Cacho P.R., et al., 2007Methven L., Tsoukka M., et al., 2007Rochat S., de Saint Laumer J.Y., et al., 2007Rochat S., de Saint Laumer J.Y., et al., 2007
Comment MSDC-RI MSDC-RI MSDC-RI MSDC-RI MSDC-RI
Column type CapillaryCapillaryCapillaryCapillaryCapillary
Active phase DB-1DB-1ZB-5DB-5SE-54
Column length (m) 20.20.30.30.50.
Carrier gas   HeHeHe
Substrate
Column diameter (mm) 0.180.180.320.320.32
Phase thickness (μm) 0.180.180.50.24
Tstart (C) 60.60.40.40.40.
Tend (C) 220.220.265.240.240.
Heat rate (K/min) 8.8.7.6.8.
Initial hold (min) 3.3. 2.2.
Final hold (min) 5.5.5.10.5.
I 861.863.908.902.920.
ReferenceRochat S., de Saint Laumer J.Y., et al., 2007Rochat S., de Saint Laumer J.Y., et al., 2007Ruiz Perez-Cacho, Mahattanatawee, et al., 2007Scheidig, Czerny, et al., 2007Schlutt B., Moran N., et al., 2007
Comment MSDC-RI MSDC-RI MSDC-RI MSDC-RI MSDC-RI
Column type CapillaryCapillaryCapillaryCapillaryCapillary
Active phase DB-5DB-5MSCP Sil 8 CBDB-5MSDB-5MS
Column length (m) 30.30.50.60.60.
Carrier gas  He H2H2
Substrate
Column diameter (mm) 0.320.250.320.250.25
Phase thickness (μm) 0.250.25 0.250.25
Tstart (C) 40.40.60.30.30.
Tend (C) 240.200.220.250.250.
Heat rate (K/min) 6.4.4.2.2.
Initial hold (min) 2.1.5.2.2.
Final hold (min) 10.10.30.2.2.
I 906.914.900.905.905.
ReferenceSteinhaus and Schieberle, 2007Cho, Kim, et al., 2006Mahadevan and Farmer, 2006Schwambach and Peterson, 2006Schwambach and Peterson, 2006
Comment MSDC-RI MSDC-RI MSDC-RI MSDC-RI MSDC-RI
Column type CapillaryCapillaryCapillaryCapillaryCapillary
Active phase DB-5MSCP Sil 8 CBDB-5MSDB-5DB-5
Column length (m) 30.5.30.30.30.
Carrier gas He  N2N2
Substrate
Column diameter (mm) 0.250.320.250.250.32
Phase thickness (μm) 0.25 0.250.251.
Tstart (C) 40.60.40.30.40.
Tend (C) 200.220.200.250.230.
Heat rate (K/min) 5.4.10.3.4.
Initial hold (min) 5.5.3.2.2.
Final hold (min) 45.30.20.2.10.
I 932.904.915.909.910.
ReferenceWhetstine M.E.C., Drake M.A., et al., 2006Aliani and Farmer, 2005Carunchia Whetstine, Croissant, et al., 2005Colahan-Sederstrom and Peterson, 2005Fang and Qian, 2005
Comment MSDC-RI MSDC-RI MSDC-RI MSDC-RI MSDC-RI
Column type CapillaryCapillaryCapillaryCapillaryCapillary
Active phase DB-5MSDB-5DB-5ZB-5ZB-5
Column length (m) 30.30.30.30.0.
Carrier gas    Helium
Substrate
Column diameter (mm) 0.250.250.250.320.32
Phase thickness (μm) 0.250.250.250.500.5
Tstart (C) 40.40.40.40.40.
Tend (C) 200.200.200.265.265.
Heat rate (K/min) 10.10.10.7.7.
Initial hold (min) 3.5.5.
Final hold (min) 20.15.15.5.5.
I 911.911.911.906.904.
ReferenceWhetstine, Cadwallader, et al., 2005Avsar, Karagul-Yuceer, et al., 2004Avsar, Karagul-Yuceer, et al., 2004Bell, 2004Gocmen, Gurbuz, et al., 2004
Comment MSDC-RI MSDC-RI MSDC-RI MSDC-RI MSDC-RI
Column type CapillaryCapillaryCapillaryCapillaryCapillary
Active phase DB-5SPB-5HP-5DB-5MSDB-5MS
Column length (m) 30.30.30.30.30.
Carrier gas HeHe HeHe
Substrate
Column diameter (mm) 0.320.250.250.250.25
Phase thickness (μm) 1.0.250.10.250.25
Tstart (C) 40.60.-30.40.35.
Tend (C) 230.250.250.200.200.
Heat rate (K/min) 5.4.10.4.10.
Initial hold (min) 4.2.1.5.5.
Final hold (min) 10.20.5.20.30.
I 902.904.905.918.906.
ReferenceMahajan, Goddik, et al., 2004Pino, Marbot, et al., 2004Siegmund and Murkovic, 2004Zheng, Kim, et al., 2004Karagül-Yüceer, Vlahovich, et al., 2003
Comment MSDC-RI MSDC-RI MSDC-RI MSDC-RI MSDC-RI
Column type CapillaryCapillaryCapillaryCapillaryCapillary
Active phase DB-5DB-5CP Sil 8 CBDB-5SPB-5
Column length (m) 30.60.60.30.30.
Carrier gas  HeHe He
Substrate
Column diameter (mm) 0.250.250.250.320.25
Phase thickness (μm) 0.250.250.250.250.25
Tstart (C) 35.40.40.35.60.
Tend (C) 250.275.250.200.250.
Heat rate (K/min) 4.7.4.10.4.
Initial hold (min) 2. 8.5.2.
Final hold (min) 4. 10.30.20.
I 906.903.925.899.909.
ReferencePeterson and Reineccius, 2003Valim, Rouseff, et al., 2003Duckham, Dodson, et al., 2002Karagül-Yüceer, Cadwallader, et al., 2002Pino, Marbot, et al., 2002
Comment MSDC-RI MSDC-RI MSDC-RI MSDC-RI MSDC-RI
Column type CapillaryCapillaryCapillaryCapillaryCapillary
Active phase DB-5DB-5DB-5DB-5DB-5MS
Column length (m) 30.30.15.15.60.
Carrier gas HeHe  He
Substrate
Column diameter (mm) 0.320.320.320.320.25
Phase thickness (μm) 0.250.250.50.50.25
Tstart (C) 40.40.30.30.40.
Tend (C) 220.220.225.225.200.
Heat rate (K/min) 10.10.10.10.3.
Initial hold (min) 5.5.2.2.5.
Final hold (min) 30.30.20.20.60.
I 910.908.906.910.906.
ReferenceWu and Cadwallader, 2002Wu and Cadwallader, 2002Zhou, Wintersteen, et al., 2002Zhou, Wintersteen, et al., 2002Baek, Kim, et al., 2001
Comment MSDC-RI MSDC-RI MSDC-RI MSDC-RI MSDC-RI
Column type CapillaryCapillaryCapillaryCapillaryCapillary
Active phase DB-5DB-5DB-5DB-5DB-5MS
Column length (m) 30.30.30.30.60.
Carrier gas HeHeHe He
Substrate
Column diameter (mm) 0.320.320.320.320.25
Phase thickness (μm) 0.50.50.50.250.25
Tstart (C) 33.33.33.35.40.
Tend (C) 230.230.230.200.200.
Heat rate (K/min) 8.8.8.10.2.
Initial hold (min) 5.5.5.5.5.
Final hold (min) 8.8.8.30.30.
I 917.917.918.904.907.
ReferenceBezman, Rouseff, et al., 2001Bezman, Rouseff, et al., 2001Bezman, Rouseff, et al., 2001Karagül-Yüceer, Drake, et al., 2001Lee, Suriyaphan, et al., 2001
Comment MSDC-RI MSDC-RI MSDC-RI MSDC-RI MSDC-RI
Column type CapillaryCapillaryCapillaryCapillaryCapillary
Active phase DB-1BPX-5DB-5HP-5DB-5
Column length (m) 30.50.30.30.30.
Carrier gas  HeHeHeH2
Substrate
Column diameter (mm) 0.320.320.0530.250.32
Phase thickness (μm) 0.250.251.50.251.
Tstart (C) 40.35.0.35.40.
Tend (C) 240.250.230.280.210.
Heat rate (K/min) 7.4.6.5.33.
Initial hold (min)  3.
Final hold (min) 5.10. 5.
I 867.921.909.905.1909.
ReferenceLin and Rouseff, 2001Oruna-Concha, Duckham, et al., 2001Rychlik and Bosset, 2001Siegmund, Derler, et al., 2001Moio, Piombino, et al., 2000
Comment MSDC-RI MSDC-RI MSDC-RI MSDC-RI MSDC-RI
Column type CapillaryCapillaryCapillaryCapillaryCapillary
Active phase DB-5CP Sil 8 CBBPX-5BPX-5BPX-5
Column length (m) 30.50.50.50.50.
Carrier gas H2 HeHeHe
Substrate
Column diameter (mm) 0.320.320.320.320.32
Phase thickness (μm) 1. 0.250.250.50
Tstart (C) 40.60.50.50.40.
Tend (C) 210.220.250.250.280.
Heat rate (K/min) 3.4.4.4.4.
Initial hold (min)  5.5.5.
Final hold (min)  30.5.5.
I 910.898.909.924.928.
ReferenceMoio, Piombino, et al., 2000Chevance and Farmer, 1999Mandin, Duckham, et al., 1999Mandin, Duckham, et al., 1999Aaslyng, Elmore, et al., 1998
Comment MSDC-RI MSDC-RI MSDC-RI MSDC-RI MSDC-RI
Column type CapillaryCapillaryCapillaryCapillaryCapillary
Active phase DB-5MSDB-5DB-5RTX-5SE-30
Column length (m) 30.30.30.30.50.
Carrier gas  H2H2
Substrate
Column diameter (mm) 0.320.320.320.530.32
Phase thickness (μm) 0.251.1.1.50.25
Tstart (C) 40.40.40.0.50.
Tend (C) 200.210.210.250.250.
Heat rate (K/min) 6.3.3.8.4.
Initial hold (min) 5.  1.
Final hold (min) 30.
I 908.909.909.910.890.
ReferenceCha and Cadwallader, 1998Moio and Addeo, 1998Moio and Addeo, 1998Milo and Reineccius, 1997Misharina and Golovnya, 1996
Comment MSDC-RI MSDC-RI MSDC-RI MSDC-RI MSDC-RI
Column type CapillaryCapillaryCapillaryCapillary
Active phase DB-1DB-1OV-101SE-30
Column length (m) 60.60.50.50.
Carrier gas   He
Substrate
Column diameter (mm) 0.250.250.320.32
Phase thickness (μm) 0.250.250.500.25
Tstart (C) 35.35.50.50.
Tend (C) 280.280.250.240.
Heat rate (K/min) 2.2.2.4.
Initial hold (min) 10.10.
Final hold (min) 10.10.
I 864.866.872.880.
ReferenceSpecht and Baltes, 1994Specht and Baltes, 1994Misharina, Aerove, et al., 1991Misharina, Golovnya, et al., 1991
Comment MSDC-RI MSDC-RI MSDC-RI MSDC-RI

Normal alkane RI, polar column, custom temperature program

Data compiled by: NIST Mass Spectrometry Data Center, William E. Wallace, director

Column type CapillaryCapillaryCapillaryCapillaryCapillary
Active phase EC-1000DB-WaxDB-WaxDB-FFAPDB-FFAP
Column length (m)  30.30.30.30.
Carrier gas  Hydrogen
Substrate
Column diameter (mm)  0.320.320.320.32
Phase thickness (μm)  0.500.500.250.25
Program not specified40 0C (5 min) 4 0C/min -> 100 0C 6 0C/min -> 220 0C (20 min)40 0C (5 min) 4 0C/min -> 100 0C 6 0C/min -> 220 0C (40 min)40C(2min) => 40C/min => 60C(2min) => 6C/min => 180C => 15C/min => 230C(10min)40C(2min) => 40C/min => 60C(2min) => 6C/min => 180C => 15C/min => 230C(10min)
I 1470.1452.1452.1452.1449.
ReferenceDelabre and Bendall, 9999San-Juan, Petka, et al., 2010Ferreira, Juan, et al., 2009Buettner, 2007Buettner, 2007
Comment MSDC-RI MSDC-RI MSDC-RI MSDC-RI MSDC-RI
Column type CapillaryCapillaryCapillaryCapillaryCapillary
Active phase HP-FFAPDB-FFAPHP-InnowaxHP-InnowaxFFAP
Column length (m) 30.30.60.60.25.
Carrier gas   HeliumHeliumHe
Substrate
Column diameter (mm) 0.320.320.320.320.32
Phase thickness (μm) 0.250.250.250.250.3
Program 35 0C (10 min) 10 0C/min -> 150 0C 20 0C/min -> 250 0C (10 min)35C(2min) => 40C/min => 50C(2min) => 6C/min => 180C => 10C/min => 230C(10min)40 0C (5 min) 4 0C/min -> 60 0C (5 min) 8 0C/min -> 250 0C (3 min)not specified36C => 20C/min => 85C => 1C/min => 145C => 3C/min => 250C
I 1471.1460.1469.1418.1414.
ReferenceCarrapiso and Garsia, 2007Lasekan, Buettner, et al., 2007Viegas and Bassoli, 2007Viegas and Bassoli, 2007Bailly, Jerkovic, et al., 2006
Comment MSDC-RI MSDC-RI MSDC-RI MSDC-RI MSDC-RI
Column type CapillaryCapillaryCapillaryCapillaryCapillary
Active phase DB-FFAPDB-FFAPDB-FFAPDB-FFAPDB-FFAP
Column length (m) 30.30.30.30.30.
Carrier gas HeHeHeHeHe
Substrate
Column diameter (mm) 0.320.320.320.320.32
Phase thickness (μm) 0.250.250.250.250.25
Program 40C (2min) => 40C/min => 60C(2min) => 6C/min => 180C => 15C/min => 230C(10min)40C (2min) => 40C/min => 60C(2min) => 6C/min => 180C => 15C/min => 230C(10min)40C(2min) => 40C/min => 60C(2min) => 6C/min => 180C => 15C/min => 230C (10min)40C(2min) => 40C/min => 60C(2min) => 6C/min => 180C => 15C/min => 230C (10min)40C(2min) => 40C/min => 60C(2min) => 6C/min => 180C => 15C/min => 230C (10min)
I 1449.1449.1449.1449.1449.
ReferenceBuettner and Welle, 2004Buettner and Welle, 2004Buettner, 2004Buettner, 2004Buettner, 2004
Comment MSDC-RI MSDC-RI MSDC-RI MSDC-RI MSDC-RI
Column type CapillaryCapillaryCapillaryCapillaryCapillary
Active phase FFAPDB-WaxCP-WAX 57CBDB-WaxDB-Wax
Column length (m) 30.60.50. 60.
Carrier gas HeHeliumHe He
Substrate
Column diameter (mm) 0.320.250.25 0.32
Phase thickness (μm) 0.250.250.2 0.5
Program 35C(1min) => 60C/min => 60C => 6C/min => 230C60 0C (3 min) 2 0C/min -> 150 0C 4 0C/min -> 200 0C40C(10min) => 5C/min => 100C => 3C/min => 180C => 20C/min => 210C (10min)not specified35C(4min) => 2C/min => 130C => 4C/min => 250C
I 1465.1452.1468.1461.1458.
ReferenceDidzbalis, Ritter, et al., 2004Kim. J.H., Ahn, et al., 2004Martí, Mestres, et al., 2003Peterson and Reineccius, 2003Qian and Reineccius, 2003
Comment MSDC-RI MSDC-RI MSDC-RI MSDC-RI MSDC-RI
Column type CapillaryCapillaryCapillaryCapillaryCapillary
Active phase DB-FFAPSupelcowax-10TRWAXFFAPDB-FFAP
Column length (m) 30.60.60.30.30.
Carrier gas H2HeHeHeHe
Substrate
Column diameter (mm) 0.30.250.250.320.32
Phase thickness (μm) 0.250.250.250.250.25
Program 35C (1min) => 40C/min => 60C (5min) => 4C/min => 220C40C(20min) => (1.5C/min) => 200C => (10C/min) => 250C(120min)not specified35C (2min) => 40C/min => 60C (2min) => 6C/min => 180C => 10C/min => 230C (10min)35 0C (2 min) 40 K/min -> 60 0C (1 min) 6 K/min -> 240 0C
I 1446.1427.1495.1449.1450.
ReferenceTriqui and Bouchriti, 2003Rogerson and de Freitas, 2002Torrens, 2002Buettner and Schieberle, 2001Mayer and Grosch, 2001
Comment MSDC-RI MSDC-RI MSDC-RI MSDC-RI MSDC-RI
Column type CapillaryCapillaryCapillaryCapillaryCapillary
Active phase FFAPDB-FFAPCP Wax 52 CBFFAPFFAP
Column length (m) 25.30.50.
Carrier gas HeHe
Substrate
Column diameter (mm) 0.320.320.32
Phase thickness (μm) 0.25 0.20
Program 35C(2min) => 40C/min => 60C(2min) => 6C/min => 230C35C => 40C/min => 60C (1min) => 6C/min => 250C50 0C (10 min) 2 0C/min -> 100 0C 5 0C/min -> 150 0C 7 0C/min -> 220 0C (20 min)not specifiednot specified
I 1439.1448.1444.1465.1445.
ReferenceZehentbauer and Grosch, 1998Lizárraga-Guerra, Guth, et al., 1997Patterson and Stevenson, 1995Blank, Stampfli, et al., 1994Guth and Grosch, 1994
Comment MSDC-RI MSDC-RI MSDC-RI MSDC-RI MSDC-RI
Column type CapillaryCapillaryCapillaryCapillary
Active phase Supelcowax-10FFAPDB-WaxFFAP
Column length (m) 30. 30.
Carrier gas He He
Substrate
Column diameter (mm) 0.32 0.25
Phase thickness (μm)   0.5
Program 35C => 40C/min => 60C(2min) => 4C/min => 240Cnot specified35C => 40C/min => 50C(2min) => 6C/min => 200Cnot specified
I 1451.1445.1458.1455.
ReferenceSchieberle and Grosch, 1994Guth and Grosch, 1993Milo and Grosch, 1993Blank, Sen, et al., 1992
Comment MSDC-RI MSDC-RI MSDC-RI MSDC-RI

References

Cho, Namgung, et al., 2008
Cho, I.H.; Namgung, H.-J.; Choi, H.-K.; Kim, Y.-S., Volatiles and key odorants in the pileus and stipe of pine-mushroom (Tricholoma matsutake Sing.), Food Chem., 2008, 106, 1, 71-76, https://doi.org/10.1016/j.foodchem.2007.05.047 . [all data]

Cho I.H., Lee S.M., et al., 2007
Cho I.H.; Lee S.M.; Kim S.Y.; Choi H.K.; Kim K.O.; Kim Y.S., Differentiation of aroma characteristics of pine-mushrooms (Tricholoma matsutake Sing.) of different grades using gas chromatography-olfactometry and sensory analysis, J. Agric. Food Chem., 2007, 55, 6, 2323-2328, https://doi.org/10.1021/jf062702z . [all data]

Engel and Ratel, 2007
Engel, E.; Ratel, J., Correction of the data generated by mass spectrometry analyses of biological tissues: Application to food authentication, J. Chromatogr. A, 2007, 1154, 1-2, 331-341, https://doi.org/10.1016/j.chroma.2007.02.012 . [all data]

Jarunrattanasri, Theerakulkait, et al., 2007
Jarunrattanasri, A.; Theerakulkait, C.; Cadwallader, K.R., Aroma Components of Acid-Hydrolyzed Vegetable Protein Made by Partial Hydrolysis of Rice Bran Protein, J. Agric. Food Chem., 2007, 55, 8, 3044-3050, https://doi.org/10.1021/jf0631474 . [all data]

Lozano P.R., Drake M., et al., 2007
Lozano P.R.; Drake M.; Benitez D.; Cadwallader K.R., Instrumental and sensory characterization of heat-induced odorants in aseptically packaged soy milk, J. Agric. Food Chem., 2007, 55, 8, 3018-3026, https://doi.org/10.1021/jf0631225 . [all data]

Mahattanatawee K., Perez-Cacho P.R., et al., 2007
Mahattanatawee K.; Perez-Cacho P.R.; Davenport T.; Rouseff R., Comparison of three lychee cultivar odor profiles using gas chromatography-olfactometry and gas chromatography-sulfur detection, J. Agric. Food Chem., 2007, 55, 5, 1939-1944, https://doi.org/10.1021/jf062925p . [all data]

Methven L., Tsoukka M., et al., 2007
Methven L.; Tsoukka M.; Oruna-Concha M.J.; Parker J.K.; Mottram D.S., Influence of sulfur amino acids on the volatile and nonvolatile components of cooked salmon (Salmo salar), J. Agric. Food Chem., 2007, 55, 4, 1427-1436, https://doi.org/10.1021/jf0625611 . [all data]

Rochat S., de Saint Laumer J.Y., et al., 2007
Rochat S.; de Saint Laumer J.Y.; Chaintreau A., Analysis of sulfur compounds from the in-oven roast beef aroma by comprehensive two-dimensional gas chromatography, J. Chromatogr. A, 2007, 1147, 1, 85-94, https://doi.org/10.1016/j.chroma.2007.02.039 . [all data]

Ruiz Perez-Cacho, Mahattanatawee, et al., 2007
Ruiz Perez-Cacho, P.; Mahattanatawee, K.; Smoot, J.M.; Rouseff, R., Identification of Sulfur Volatiles in Canned Orange Juices Lacking Orange Flavor, J. Agric. Food Chem., 2007, 55, 14, 5761-5767, https://doi.org/10.1021/jf0703856 . [all data]

Scheidig, Czerny, et al., 2007
Scheidig, C.; Czerny, M.; Schieberle, P., Changes in Key Odorants of Raw Coffee Beans during Storage under Defined Conditions, J. Agric. Food Chem., 2007, 55, 14, 5768-5775, https://doi.org/10.1021/jf070488o . [all data]

Schlutt B., Moran N., et al., 2007
Schlutt B.; Moran N.; Schieberle P.; Hofmann T., Sensory-directed identification of creaminess-enhancing volatiles and semivolatiles in full-fat cream, J. Agric. Food Chem., 2007, 55, 23, 9634-9645, https://doi.org/10.1021/jf0721545 . [all data]

Steinhaus and Schieberle, 2007
Steinhaus, P.; Schieberle, P., Characterization of the key aroma compounds in soy sauce using approaches of molecular sensory science, J. Agric. Food Chem., 2007, 55, 15, 6262-6269, https://doi.org/10.1021/jf0709092 . [all data]

Cho, Kim, et al., 2006
Cho, I.H.; Kim, S.Y.; Choi, H.-K.; Kim, Y.-S., Characterization of Aroma-Active Compounds in Raw and Cooked Pine-Mushrooms (Tricholoma matsutake Sing.), J. Agric. Food Chem., 2006, 54, 17, 6332-6335, https://doi.org/10.1021/jf060824l . [all data]

Mahadevan and Farmer, 2006
Mahadevan, K.; Farmer, L., Key Odor Impact Compounds in Three Yeast Extract Pastes, J. Agric. Food Chem., 2006, 54, 19, 7242-7250, https://doi.org/10.1021/jf061102x . [all data]

Schwambach and Peterson, 2006
Schwambach, S.L.; Peterson, D.G., Reduction of Stale Flavor Development in Low-Heat Skim Milk Powder via Epicatechin Addition, J. Agric. Food Chem., 2006, 54, 2, 502-508, https://doi.org/10.1021/jf0519764 . [all data]

Whetstine M.E.C., Drake M.A., et al., 2006
Whetstine M.E.C.; Drake M.A.; Nelson B.K.; Barbano D.M., Flavor profiles of full-fat and reduced-fat cheese and cheese fat made from aged cheddar with the fat removed using a novel process, J. Dairy Res., 2006, 89, 2, 505-517, https://doi.org/10.3168/jds.S0022-0302(06)72113-0 . [all data]

Aliani and Farmer, 2005
Aliani, M.; Farmer, L.J., Precursors of chicken flavor. II. Identification of key flavor precursors using sensory methods, J. Agric. Food Chem., 2005, 53, 16, 6455-6462, https://doi.org/10.1021/jf050087d . [all data]

Carunchia Whetstine, Croissant, et al., 2005
Carunchia Whetstine, M.E.; Croissant, A.E.; Drake, M.A., Characterization of Dried Whey Protein Concentrate and Isolate Flavor, J. Dairy Sci., 2005, 88, 11, 3826-3839, https://doi.org/10.3168/jds.S0022-0302(05)73068-X . [all data]

Colahan-Sederstrom and Peterson, 2005
Colahan-Sederstrom, P.M.; Peterson, D.G., Inhibition of key aroma compound generated during ultrahigh-temperature processing of bovine milk via epicatechin addition, J. Agric. Food Chem., 2005, 53, 2, 398-402, https://doi.org/10.1021/jf0487248 . [all data]

Fang and Qian, 2005
Fang, Y.; Qian, M., Aroma compounds in Oregon Pinot Noir wine determined by aroma extract dilution analysis (AEDA), Flavour Fragr. J., 2005, 20, 1, 22-29, https://doi.org/10.1002/ffj.1551 . [all data]

Whetstine, Cadwallader, et al., 2005
Whetstine, M.E.C.; Cadwallader, K.R.; Drake, M.A., Characterization of aroma compounds responsible for the rosy/floral flavor in cheddar cheese, J. Agric. Food Chem., 2005, 53, 8, 3126-3132, https://doi.org/10.1021/jf048278o . [all data]

Avsar, Karagul-Yuceer, et al., 2004
Avsar, Y.K.; Karagul-Yuceer, Y.; Drake, M.A.; Singh, T.K.; Yoon, Y.; Cadwallader, K.R., Characterization of nutty flavor in cheddar cheese, J. Dairy Sci., 2004, 87, 7, 1999-2010, https://doi.org/10.3168/jds.S0022-0302(04)70017-X . [all data]

Bell, 2004
Bell, W.A.-M., Examination of Aroma Volatiles Formed from Thermal Processing of Florida Reconstituted Grapefruit Juice. A Thesis presented to the graduate school of the university of Florida in partial fulfillment of the requirements for the degree of master of science, 2004. [all data]

Gocmen, Gurbuz, et al., 2004
Gocmen, D.; Gurbuz, O.; Rouseff, R.L.; Smoot, J.M.; Dagdelen, A.F., Gas chromatographic-olfactometric characterization of aroma active compounds in sun-dried and vacuum-dried tarhana, Eur. Food Res. Technol., 2004, 218, 6, 573-578, https://doi.org/10.1007/s00217-004-0913-6 . [all data]

Mahajan, Goddik, et al., 2004
Mahajan, S.S.; Goddik, L.; Qian, M.C., Aroma Compounds in Sweet Whey Powder, J. Dairy Sci., 2004, 87, 12, 4057-4063, https://doi.org/10.3168/jds.S0022-0302(04)73547-X . [all data]

Pino, Marbot, et al., 2004
Pino, J.A.; Marbot, R.; Vazquez, C., Volatile components of tamarind (Tamarindus indica L.) grown in Cuba, J. Essent. Oil Res., 2004, 16, 4, 318-320, https://doi.org/10.1080/10412905.2004.9698731 . [all data]

Siegmund and Murkovic, 2004
Siegmund, B.; Murkovic, M., Changes in chemical composition of pumpkin seeds during the roasting process for production of pumpkin seed oil (Part 2: volatile compounds), Food Chem., 2004, 84, 3, 367-374, https://doi.org/10.1016/S0308-8146(03)00241-3 . [all data]

Zheng, Kim, et al., 2004
Zheng, C.H.; Kim, T.H.; Kim, K.H.; Leem, Y.H.; Lee, H.J., Characterization of potent aroma compounds in Chrysanthemum coronarium L. (Garland) using aroma extract dilution analysis, Flavour Fragr. J., 2004, 19, 5, 401-405, https://doi.org/10.1002/ffj.1447 . [all data]

Karagül-Yüceer, Vlahovich, et al., 2003
Karagül-Yüceer, Y.; Vlahovich, K.N.; Drake, M.A.; Cadwallader, K.R., Characteristic aroma components of rennet casein, J. Agric. Food Chem., 2003, 51, 23, 6797-6801, https://doi.org/10.1021/jf0345806 . [all data]

Peterson and Reineccius, 2003
Peterson, D.G.; Reineccius, G.A., Determination of the aroma impact compounds in heated sweet cream butter, Flavour Fragr. J., 2003, 18, 4, 320-324, https://doi.org/10.1002/ffj.1228 . [all data]

Valim, Rouseff, et al., 2003
Valim, M.F.; Rouseff, R.L.; Lin, J., Gas chromatographic-olfactometric characterization of aroma compounds in two types of cashew apple nectar, J. Agric. Food Chem., 2003, 51, 4, 1010-1015, https://doi.org/10.1021/jf025738+ . [all data]

Duckham, Dodson, et al., 2002
Duckham, S.C.; Dodson, A.T.; Bakker, J.; Ames, J.M., Effect of cultivar and storage time on the volatile flavor components of baked potato, J. Agric. Food Chem., 2002, 50, 20, 5640-5648, https://doi.org/10.1021/jf011326+ . [all data]

Karagül-Yüceer, Cadwallader, et al., 2002
Karagül-Yüceer, Y.; Cadwallader, K.R.; Drake, M.A., Volatile flavor components of stored nonfat dry milk, J. Agric. Food Chem., 2002, 50, 2, 305-312, https://doi.org/10.1021/jf010648a . [all data]

Pino, Marbot, et al., 2002
Pino, J.; Marbot, R.; Rosado, A., Volatile constituents of star apple (Chrysophyllum cainito L.) from Cuba, Flavour Fragr. J., 2002, 17, 5, 401-403, https://doi.org/10.1002/ffj.1116 . [all data]

Wu and Cadwallader, 2002
Wu, Y.-F.G.; Cadwallader, K.R., Characterization of the aroma of a meatlike process flavoring from soybean-based enzyme-hydrolyzed vegetable protein, J. Agric. Food Chem., 2002, 50, 10, 2900-2907, https://doi.org/10.1021/jf0114076 . [all data]

Zhou, Wintersteen, et al., 2002
Zhou, Q.; Wintersteen, C.L.; Cadwallader, K.R., Identification and quantification of aroma-active components that contribute to the distinct malty flavor of buckwheat honey, J. Agric. Food Chem., 2002, 50, 7, 2016-2021, https://doi.org/10.1021/jf011436g . [all data]

Baek, Kim, et al., 2001
Baek, H.H.; Kim, C.J.; Ahn, B.H.; Nam, H.S.; Cadwallader, K.R., Aroma extract dilution analysis of a beeflike process flavor from extruded enzyme-hydrolyzed soybean protein, J. Agric. Food Chem., 2001, 49, 2, 790-793, https://doi.org/10.1021/jf000609j . [all data]

Bezman, Rouseff, et al., 2001
Bezman, Y.; Rouseff, R.L.; Naim, M., 2-Methyl-3-furanthiol and methional are possible off-flavors in stored orange juice: aroma-similarity, NIF/SNIF GC-O, and GC analyses, J. Agric. Food Chem., 2001, 49, 11, 5425-5432, https://doi.org/10.1021/jf010724+ . [all data]

Karagül-Yüceer, Drake, et al., 2001
Karagül-Yüceer, Y.; Drake, M.; Cadwallader, K.R., Aroma-active components of nonfat dry milk, J. Agric. Food Chem., 2001, 49, 6, 2948-2953, https://doi.org/10.1021/jf0009854 . [all data]

Lee, Suriyaphan, et al., 2001
Lee, G.-H.; Suriyaphan, O.; Cadwallader, K.R., Aroma components of cooked tail meat of American lobster (Homarus americanus), J. Agric. Food Chem., 2001, 49, 9, 4324-4332, https://doi.org/10.1021/jf001523t . [all data]

Lin and Rouseff, 2001
Lin, J.; Rouseff, R.L., Characterization of aroma-impact compounds in cold-pressed grapefruit oil using time-intensity GC-olfactometry and GC-MS, Flavour Fragr. J., 2001, 16, 6, 457-463, https://doi.org/10.1002/ffj.1041 . [all data]

Oruna-Concha, Duckham, et al., 2001
Oruna-Concha, M.J.; Duckham, S.C.; Ames, J.M., Comparison of volatile compounds isolated from the skin and flesh of four potato cultivars after baking, J. Agric. Food Chem., 2001, 49, 5, 2414-2421, https://doi.org/10.1021/jf0012345 . [all data]

Rychlik and Bosset, 2001
Rychlik, M.; Bosset, J.O., Flavour and off-flavour compoundsof SwissGruy ere cheese. Evaluation of potent odorants, Int. Dairy J., 2001, 11, 11-12, 895-901, https://doi.org/10.1016/S0958-6946(01)00108-X . [all data]

Siegmund, Derler, et al., 2001
Siegmund, B.; Derler, K.; Pfannhauser, W., Changes in the aroma of a strawberry drink during storage, J. Agric. Food Chem., 2001, 49, 7, 3244-3252, https://doi.org/10.1021/jf010116u . [all data]

Moio, Piombino, et al., 2000
Moio, L.; Piombino, P.; Addeo, F., Odour-impact compounds of Gorgonzola cheese, J. Dairy Res., 2000, 67, 2, 273-285, https://doi.org/10.1017/S0022029900004106 . [all data]

Chevance and Farmer, 1999
Chevance, F.F.V.; Farmer, L.J., Identification of major volatile odor compounds in frankfurters, J. Agric. Food Chem., 1999, 47, 12, 5151-5160, https://doi.org/10.1021/jf990515d . [all data]

Mandin, Duckham, et al., 1999
Mandin, O.; Duckham, S.C.; Ames, J.M., Volatile compounds from potato-like model systems, J. Agric. Food Chem., 1999, 47, 6, 2355-2359, https://doi.org/10.1021/jf981277+ . [all data]

Aaslyng, Elmore, et al., 1998
Aaslyng, M.D.; Elmore, J.S.; Mottram, D.S., Comparison of the aroma characteristics of acid-hydrolyzed and enzyme-hydrolyzed vegetable proteins produced from soy, J. Agric. Food Chem., 1998, 46, 12, 5225-5231, https://doi.org/10.1021/jf9806816 . [all data]

Cha and Cadwallader, 1998
Cha, Y.J.; Cadwallader, K.R., Aroma-active compounds in skipjack tuna sauce, J. Agric. Food Chem., 1998, 46, 3, 1123-1128, https://doi.org/10.1021/jf970380g . [all data]

Moio and Addeo, 1998
Moio, L.; Addeo, F., Grana Padano cheese aroma, J. Dairy Res., 1998, 65, 2, 317-333, https://doi.org/10.1017/S0022029997002768 . [all data]

Milo and Reineccius, 1997
Milo, C.; Reineccius, G.A., Identification and quantification of potent odorants in regular-fat and low-fat mild cheddar cheese, J. Agric. Food Chem., 1997, 45, 9, 3590-3594, https://doi.org/10.1021/jf970152m . [all data]

Misharina and Golovnya, 1996
Misharina, T.A.; Golovnya, R.V., Study of the composition of volatiles in raw and processed sardine by gas chromatography and gas chromatography-mass spectrometry, Zh. Anal. Khim., 1996, 51, 7, 791-795. [all data]

Specht and Baltes, 1994
Specht, K.; Baltes, W., Identification of volatile flavor compounds with high aroma values from shallow-fried beef, J. Agric. Food Chem., 1994, 42, 10, 2246-2253, https://doi.org/10.1021/jf00046a031 . [all data]

Misharina, Aerove, et al., 1991
Misharina, T.A.; Aerove, A.F.; Golovnya, R.E.; Kalugina, V.I.; Rogovskaya, L.V.; Vysotskaya, L.E.; Shevtsov, V.K., Identification of volatile components of an aromatizer with a chicken odor by chromatography-mass spectrometry and chromatography-fourier transform infrared spectroscopy, J. Anal. Chem. USSR (Engl. Transl.), 1991, 8, 1187-1193. [all data]

Misharina, Golovnya, et al., 1991
Misharina, T.A.; Golovnya, R.V.; Yakovleva, V.N.; Vitt, S.V., Pyrazines formed in model glycerin-water systems, Russ. Chem. Bull. (Engl. Transl.), 1991, 40, 9, 1742-1748, https://doi.org/10.1007/BF00960396 . [all data]