Iridium, dicarbonyl(pentamethyl-η5-cyclopentadienyl)-

Phase change data

Data compiled by: William E. Acree, Jr., James S. Chickos

Enthalpy of sublimation

ΔsubH (kJ/mol) Temperature (K) Method Reference
105.0 ± 3.4297. - 332.MEMorozova, Semyannikov, et al., 2009

Gas phase ion energetics data

Data compiled by: Sharon G. Lias, John E. Bartmess, Joel F. Liebman, John L. Holmes, Rhoda D. Levin, and W. Gary Mallard

Ionization energy determinations

IE (eV) Method Reference Comment
6.60PEDudeney, Kirchner, et al., 1984
6.94PEDudeney, Kirchner, et al., 1984Vertical value

References

Morozova, Semyannikov, et al., 2009
Morozova, N.B.; Semyannikov, P.P.; Trubin, S.V.; Stabnikov, P.P.; Bessonov, A.A.; Zherikova, K.V.; Igumenov, I.K., Vapor pressure of some volatile iridium(I) compounds with carbonyl, acetylacetonate and cyclopentadienyl ligands, J Therm Anal Calorim, 2009, 96, 1, 261-266, https://doi.org/10.1007/s10973-008-9551-8 . [all data]

Dudeney, Kirchner, et al., 1984
Dudeney, N.; Kirchner, O.N.; Green, J.C.; Maitlis, P., Electronic structure and reactivity of pentamethylcyclopentadienyl complexes of cobalt, rhodium, and iridium: He-I and He-II photoelectron spectroscopic investigation, J. Chem. Soc. Dalton Trans., 1984, 1877. [all data]