Adenosine, N-(trimethylsilyl)-2',3'-bis-O-(trimethylsilyl)-, 5'-[bis(trimethylsilyl) phosphate]

Van Den Dool and Kratz RI, non-polar column, custom temperature program

View large format table.

Column type Active phase I Reference Comment
PackedSE-303114.Butts, 1970He, Chromosorb W; Column length: 2. m; Program: not specified

Normal alkane RI, non-polar column, custom temperature program

View large format table.

Column type Active phase I Reference Comment
CapillaryMethylsiloxane, 5 % Ph groups3115.Cao, Aa, et al., 2011Program: not specified

References

Butts, 1970
Butts, W.C., Gas chromatographic separation of trimethylsilyl (TMS)-nucleosides: TMS-methoxime derivatives of cytidine and deoxycytidine, J. Chromatogr. Sci., 1970, 8, 8, 474-476, https://doi.org/10.1093/chromsci/8.8.474 . [all data]

Cao, Aa, et al., 2011
Cao, B.; Aa, J.; Wang, G.; Wu, X.; Liu, L.; Li, M.; Shi, J.; Wang, X.; Zhao, C.; Zheng, T.; Guo, S.; Duan, J., GC-TOFMS analysis of metabolites in adherent MDCK cells and a movel strategy for identifying intracellular metabolic markers for use as cell amount indicators in data normalization, Anal. Bioanal. Chem., 2011, 400, 9, 2983-2993, https://doi.org/10.1007/s00216-011-4981-8 . [all data]