Nickel acetylacetonate
- Formula: C10H14NiO4
- Molecular weight: 256.9092
- IUPAC Standard InChIKey: BMGNSKKZFQMGDH-FDGPNNRMSA-L
- CAS Registry Number: 3264-82-2
- Chemical structure:

Phase change data

Data compiled by: William E. Acree, Jr., James S. Chickos
Quantity | Value | Units | Method | Reference | Comment |
---|---|---|---|---|---|
ΔsubH° | 126.4 ± 4.4 | kJ/mol | ME | Malkerova, Alikhanyan, et al., 1990 | Based on data from 357. to 420. K. |
ΔsubH° | 155. ± 80. | kJ/mol | C | Murata, Sakiyama, et al., 1985 | |
ΔsubH° | 132. ± 10. | kJ/mol | ME | Burkinshaw and Mortimer, 1984 |
Enthalpy of sublimation
ΔsubH (kJ/mol) | Temperature (K) | Method | Reference | Comment |
---|---|---|---|---|
108. ± 5. | 207. | DSC | Murray and Hill, 1987 | |
108.2 ± 4.9 | 480. | DSC | Ribeiro Da Silva and Ferrão, 1987 | |
128. ± 10. | 381. | ME | Burkinshaw and Mortimer, 1984 | Based on data from 378. to 403. K. |
95.4 | 400. | N/A | Götze, Bloss, et al., 1970 |

References

Malkerova, Alikhanyan, et al., 1990
Malkerova, I.P.; Alikhanyan, A.S.; Sevast'yanov, V.G.; Grinberg, Ya.Kh.; Gorgoraki, V.I.,
Thermal behavior of 3d transition metal acetylacetonates,
Zh. Neorg. Khim., 1990, 35, 2, 413. [all data]
Murata, Sakiyama, et al., 1985
Murata, S.; Sakiyama, M.; Seki, S.,
Sublimation calorimetric studies using a calvet microcalorimeter,
Thermochimica Acta, 1985, 88, 1, 121-126, https://doi.org/10.1016/0040-6031(85)85419-8
. [all data]
Burkinshaw and Mortimer, 1984
Burkinshaw, Philip M.; Mortimer, Colin T.,
Enthalpies of sublimation of transition metal complexes,
J. Chem. Soc., Dalton Trans., 1984, 1, 75, https://doi.org/10.1039/dt9840000075
. [all data]
Murray and Hill, 1987
Murray, J.P.; Hill, J.O.,
DSC determination of the sublimation enthalpy of tris(2,4-pentanedionato)cobalt(III) and bis(2,4-pentanedionato) nickel(II) and -copper(II),
Thermochimica Acta, 1987, 109, 2, 383-390, https://doi.org/10.1016/0040-6031(87)80034-5
. [all data]
Ribeiro Da Silva and Ferrão, 1987
Ribeiro Da Silva, Manuel A.V.; Ferrão, Maria Luísa C.C.H.,
Standard enthalpies of formation of tris(β-diketonate)chromium(III) complexes: the mean (Cr«58872»O) bond-dissociation enthalpies,
The Journal of Chemical Thermodynamics, 1987, 19, 6, 645-652, https://doi.org/10.1016/0021-9614(87)90070-X
. [all data]
Götze, Bloss, et al., 1970
Götze, H.-J.; Bloss, K.; Molketin, H.,
Dampfdruckbestimmung von Acetylacetonaten,
Zeitschrift für Physikalische Chemie, 1970, 73, 46, 314-320, https://doi.org/10.1524/zpch.1970.73.46.314
. [all data]