1,3-Butanedione, 4,4,4-trifluoro-1-phenyl-

Gas phase thermochemistry data

Data compiled by: Hussein Y. Afeefy, Joel F. Liebman, and Stephen E. Stein

Quantity Value Units Method Reference Comment
Δfgas-865.6 ± 4.2kJ/molCmRibeiro da Silva and Monte, 1992
Δfgas-875.2kJ/molCcrErastov, Kolesov, et al., 1984Hf-gas-(enol)
Δfgas-865.2kJ/molCcrErastov, Kolesov, et al., 1984Hf-gas-(keto)

Condensed phase thermochemistry data

Data compiled by: Hussein Y. Afeefy, Joel F. Liebman, and Stephen E. Stein

Quantity Value Units Method Reference Comment
Δfsolid-952.7 ± 4.1kJ/molCcrErastov, Kolesov, et al., 1984Hf-gas-(enol)
Quantity Value Units Method Reference Comment
Δcsolid-4520.8 ± 3.4kJ/molCcrErastov, Kolesov, et al., 1984Hf-gas-(enol)

References

Ribeiro da Silva and Monte, 1992
Ribeiro da Silva, M.A.V.; Monte, M.J.S., Vapour pressures and standard molar enthalpies of sublimation of four crystalline B-diketones, J. Chem. Thermodyn., 1992, 24, 1219-1228. [all data]

Erastov, Kolesov, et al., 1984
Erastov, P.A.; Kolesov, V.P.; Igumenov, I.K., Standard enthalpies of formation of some fluorinated β-diketones, Russ. J. Phys. Chem. (Engl. Transl.), 1984, 58, 1311-1313. [all data]