1,1'-Biphenyl, 2,4,4',6-tetrachloro-

Kovats' RI, non-polar column, isothermal

View large format table.

Column type Active phase Temperature (C) I Reference Comment
CapillaryOV-101150.1898.Zell, Neu, et al., 1977Column length: 27. m
CapillaryOV-101150.1898.Zell, Neu, et al., 1977Column length: 27. m

References

Zell, Neu, et al., 1977
Zell, M.; Neu, H.J.; Ballschmiter, K., Identifizierung der PCB-Komponenten durch retentionsindexvergleich nach kapillar-gaschromatographie, Chemosphere, 1977, 2/3, 2-3, 69-76, https://doi.org/10.1016/0045-6535(77)90047-9 . [all data]