Bicycloelemene

Kovats' RI, non-polar column, temperature ramp

View large format table.

Column type Active phase I Reference Comment
CapillaryHP-5MS1316.Siani, Garrido, et al., 200430. m/0.32 mm/0.25 μm, He, 70. C @ 5. min, 3. K/min; Tend: 250. C

Van Den Dool and Kratz RI, non-polar column, temperature ramp

View large format table.

Column type Active phase I Reference Comment
CapillaryRTX-11334.Paolini J., Costa J., et al., 200760. m/0.22 mm/0.25 μm, He, 2. K/min, 230. C @ 35. min; Tstart: 60. C
CapillaryRTX-11334.Paolini, Muselli, et al., 200760. m/0.22 mm/0.25 μm, He, 2. K/min, 230. C @ 35. min; Tstart: 60. C
CapillarySPB-11318.Radulovic, Lazarevic, et al., 200730. m/0.25 mm/0.25 μm, He, 50. C @ 3. min, 5. K/min, 250. C @ 15. min
CapillaryHP-5MS1336.Radulovic, Lazarevic, et al., 200730. m/0.25 mm/0.25 μm, He, 60. C @ 5. min, 4. K/min; Tend: 280. C
CapillarySE-541338.Brantner, Pfeifhofer, et al., 200550. m/0.25 mm/0.27 μm, H2, 5. K/min; Tstart: 50. C; Tend: 300. C
CapillaryCP Sil 5 CB1341.Idzojtic, Kajba, et al., 200550. m/0.22 mm/0.13 μm, H2, 4. K/min, 300. C @ 10. min; Tstart: 40. C
CapillaryRTX-11334.Paolini, Costa, et al., 200560. m/0.22 mm/0.25 μm, He, 2. K/min, 230. C @ 35. min; Tstart: 60. C
CapillaryDB-5MS1345.Seo and Baek, 200560. m/0.25 mm/0.25 μm, He, 2. K/min, 200. C @ 20. min; Tstart: 40. C
CapillaryOptima 51328.Vérité, Nacer, et al., 200425. m/0.25 mm/0.25 μm, He, 3. K/min, 280. C @ 20. min; Tstart: 60. C
CapillaryCP Sil 5 CB1336.Heinrich, Pfeifhofer, et al., 200250. m/0.25 mm/0.15 μm, H2, 40. C @ 3. min, 4. K/min; Tend: 300. C

Van Den Dool and Kratz RI, polar column, temperature ramp

View large format table.

Column type Active phase I Reference Comment
CapillaryRTX-Wax1481.Paolini J., Costa J., et al., 200760. m/0.22 mm/0.25 μm, He, 2. K/min, 230. C @ 35. min; Tstart: 60. C
CapillaryRTX-Wax1471.Paolini, Muselli, et al., 200760. m/0.22 mm/0.25 μm, He, 2. K/min, 230. C @ 35. min; Tstart: 60. C
CapillaryDB-Wax1478.Pala-Paul, Copeland, et al., 200660. m/0.32 mm/0.25 μm, He, 3. K/min; Tstart: 35. C; Tend: 220. C
CapillaryRTX-Wax1481.Paolini, Costa, et al., 200560. m/0.22 mm/0.25 μm, He, 2. K/min, 230. C @ 35. min; Tstart: 60. C
CapillaryDB-Wax1478.Brophy, Goldsack, et al., 200460. m/0.32 mm/0.25 μm, He, 3. K/min; Tstart: 32. C; Tend: 220. C
CapillaryDB-Wax1484.Brophy, Goldsack, et al., 200060. m/0.50 mm/1.0 μm, He, 3. K/min; Tstart: 60. C; Tend: 225. C
CapillaryDB-Wax1484.Brophy, Goldsack, et al., 2000, 260. m/0.53 mm/1.0 μm, He, 3. K/min; Tstart: 50. C; Tend: 220. C
CapillaryDB-Wax1484.Brophy, Goldsack, et al., 2000, 360. m/0.53 mm/1.0 μm, He, 3. K/min; Tstart: 50. C; Tend: 220. C
CapillaryDB-Wax1484.Brophy, Goldsack, et al., 1999He, 3. K/min; Column length: 60. m; Column diameter: 0.53 mm; Tstart: 50. C; Tend: 220. C
CapillaryDB-Wax1484.Brophy, Goldsack, et al., 1999, 2He, 3. K/min; Column length: 60. m; Column diameter: 0.53 mm; Tstart: 50. C; Tend: 220. C
CapillaryDB-Wax1482.Brophy, Forster, et al., 1998He, 3. K/min; Column length: 60. m; Column diameter: 0.32 mm; Tstart: 35. C; Tend: 220. C
CapillarySP-10001484.Brophy, Forster, et al., 1998, 2He, 3. K/min; Column length: 85. m; Column diameter: 0.5 mm; Tstart: 60. C; Tend: 225. C
CapillaryDB-Wax1484.Brophy, Goldsack, et al., 1998He, 3. K/min; Column length: 60. m; Column diameter: 0.32 mm; Tstart: 65. C; Tend: 225. C
CapillaryDB-Wax1484.Brophy, Goldsack, et al., 1998, 2He, 3. K/min; Column length: 60. m; Column diameter: 0.32 mm; Tstart: 35. C; Tend: 220. C
CapillaryDB-Wax1484.Brophy, Goldsack, et al., 1997He, 3. K/min; Column length: 60. m; Column diameter: 0.32 mm; Tstart: 65. C; Tend: 225. C
CapillarySP-10001484.Brophy, Goldsack, et al., 1997, 2He, 3. K/min; Column length: 85. m; Column diameter: 0.5 mm; Tstart: 65. C; Tend: 225. C
CapillarySupelcowax-101490.Granicher, Christen, et al., 199560. m/0.25 mm/0.25 μm, He, 60. C @ 5. min, 5. K/min, 230. C @ 20. min

Normal alkane RI, non-polar column, temperature ramp

View large format table.

Column type Active phase I Reference Comment
CapillaryHP-51343.Radulovic, Dordevic, et al., 201030. m/0.25 mm/0.25 μm, Hydrogen, 5. K/min; Tstart: 70. C; Tend: 290. C
CapillaryDB-5 MS1331.Shimizu, Imayoshi, et al., 200930. m/0.25 mm/0.25 μm, Helium, 50. C @ 2. min, 3. K/min, 220. C @ 70. min
CapillarySLB-5 MS1334.Lo Presti, Sciarrone, et al., 200830. m/0.25 mm/0.25 μm, Helium, 50. C @ 2. min, 3. K/min, 250. C @ 10. min
CapillaryHP-51328.Yassa and Akhani, 200830. m/0.25 mm/0.32 μm, Helium, 60. C @ 30. min, 5. K/min; Tend: 250. C
CapillaryHP-5MS1328.Ferhat, Tigrine-Kordjani, et al., 200730. m/0.25 mm/0.25 μm, He, 60. C @ 8. min, 2. K/min, 250. C @ 15. min
CapillaryDB-11338.Sonboli, Kanani, et al., 200760. m/0.25 mm/0.25 μm, Nitrogen, 5. K/min, 250. C @ 10. min; Tstart: 60. C
CapillaryHP-51328.Yassa and Akhani, 200730. m/0.25 mm/0.32 μm, He, 60. C @ 30. min, 5. K/min; Tend: 250. C
CapillaryHP-5MS1338.Ebrahim Sajjadi and Mehregan, 200630. m/0.25 mm/0.25 μm, 4. K/min; Tstart: 60. C; Tend: 280. C
CapillaryHP-51330.Figuérédo, Cabassu, et al., 200630. m/0.25 mm/0.25 μm, He, 50. C @ 5. min, 5. K/min, 300. C @ 5. min
CapillaryHP-51340.Kucuk, Gulec, et al., 200630. m/0.32 mm/0.25 μm, Helium, 60. C @ 2. min, 5. K/min, 260. C @ 13. min
CapillaryDB-51326.Nickavar B., Kamalinejad M., et al., 200630. m/0.25 mm/0.25 μm, 50. C @ 0.5 min, 2.5 K/min; Tend: 265. C
CapillaryCP Sil 5 CB1341.Tesso, König, et al., 2006H2, 3. K/min; Column length: 25. m; Column diameter: 0.25 mm; Tstart: 50. C; Tend: 230. C
CapillaryHP-5MS1335.Sajjadi S.E. and Eskandari B., 200530. m/0.25 mm/0.25 μm, He, 4. K/min; Tstart: 60. C; Tend: 280. C
CapillaryHP-5MS1336.Sajjadi and Ghannadi, 200530. m/0.25 mm/0.25 μm, He, 4. K/min; Tstart: 60. C; Tend: 275. C
CapillaryCP Sil 5 CB1338.Mazloomifar, Saber-Tehrani, et al., 200325. m/0.25 mm/0.39 μm, 5. K/min; Tstart: 60. C; Tend: 220. C
CapillaryHP-51336.Sajjadi and Mehregan, 200330. m/0.25 mm/0.25 μm, He, 4. K/min; Tstart: 60. C; Tend: 280. C
CapillaryCP Sil 5 CB1330.Oyedeji, Olawore, et al., 1999He, 3. K/min; Column length: 25. m; Column diameter: 0.25 mm; Tstart: 50. C; Tend: 230. C
CapillaryCP Sil 5 CB1338.Rustaiyan, Masoudi, et al., 199925. m/0.25 mm/0.39 μm, He, 60. C @ 5. min, 5. K/min, 220. C @ 20. min

Normal alkane RI, non-polar column, custom temperature program

View large format table.

Column type Active phase I Reference Comment
CapillaryDB-51335.Courtois, Paine, et al., 200930. m/0.25 mm/0.25 μm, Helium; Program: 50 0C m6 0C/min -> 140 0C 5 0C/min -> 160 0C (1 min) 10 0C/min -> 200 0C
CapillarySLB-5 MS1334.Lo Presti, Sciarrone, et al., 200830. m/0.25 mm/0.25 μm, Helium; Program: not specified
CapillaryHP-5MS1346.Novak, Draxler, et al., 200530. m/0.25 mm/0.25 μm; Program: 40C(5min) => 3C/min => 90C => 10C/min => 280C

Normal alkane RI, polar column, temperature ramp

View large format table.

Column type Active phase I Reference Comment
CapillaryDB-Wax1485.Shimizu, Imayoshi, et al., 200960. m/0.25 mm/0.25 μm, Helium, 50. C @ 2. min, 3. K/min, 220. C @ 70. min
CapillaryCP-Wax1471.Ka, Choi, et al., 200530. m/0.32 mm/0.25 μm, He, 40. C @ 2. min, 5. K/min; Tend: 180. C
CapillaryDB-Wax1480.Palá-Paúl, Brophy, et al., 200460. m/0.32 mm/0.25 μm, He, 3. K/min; Tstart: 35. C; Tend: 220. C
CapillaryBP-201495.Dunlop, Bignell, et al., 199925. m/0.33 mm/0.5 μm, 5. K/min; Tstart: 80. C; Tend: 220. C
CapillaryBP-201495.Bignell, Dunlop, et al., 199825. m/0.33 mm/0.5 μm, H2, 5. K/min; Tstart: 80. C; Tend: 220. C
CapillaryBP-201495.Bignell, Dunlop, et al., 199725. m/0.33 mm/0.5 μm, H2, 5. K/min; Tstart: 80. C; Tend: 220. C
CapillaryBP-201495.Bignell, Dunlop, et al., 1997, 225. m/0.33 mm/0.5 μm, H2, 5. K/min; Tstart: 80. C; Tend: 220. C
CapillaryBP-201495.Bignell, Dunlop, et al., 1997, 325. m/0.33 mm/0.5 μm, H2, 5. K/min; Tstart: 80. C; Tend: 220. C
CapillaryBP-201495.Bignell, Dunlop, et al., 1997, 425. m/0.33 mm/0.5 μm, 5. K/min; Tstart: 80. C; Tend: 220. C
CapillaryBP-201495.Bignell, Dunlop, et al., 1997, 525. m/0.33 mm/0.5 μm, H2, 5. K/min; Tstart: 80. C; Tend: 220. C
CapillarySP-10001484.Brophy, Goldsack, et al., 1996He, 3. K/min; Column length: 85. m; Column diameter: 0.50 mm; Tstart: 65. C; Tend: 225. C
CapillaryCarbowax 20M1472.Gaydou, Faure, et al., 198950. m/0.32 mm/0.15 μm, H2, 2. K/min; Tstart: 70. C; Tend: 210. C

Normal alkane RI, polar column, custom temperature program

View large format table.

Column type Active phase I Reference Comment
CapillaryInnowax FSC1495.Kaya, Benirci, et al., 200760. m/0.25 mm/0.25 μm, Nitrogen; Program: 60 0C (10 min) 1 0C/min -> 220 0C (10 min) 1 0C/min -> 240 0C
CapillaryInnowax FSC1495.Baser, Özek, et al., 200660. m/0.25 mm/0.25 μm, He; Program: 60C(10min) => 4C/min >220C (10min) => 1C/min => 240C
CapillaryInnowax FSC1495.Baser, Özek, et al., 200660. m/0.25 mm/0.25 μm, He; Program: 60C(10min) => 4C/min >220C (10min) => 1C/min => 240C
CapillaryHP-Innowax1495.Duman, Kartal, et al., 200560. m/0.25 mm/0.25 μm, N2; Program: 60C(10min) => 4C/min => 220C(10min) => 1C/min => 240C
CapillaryHP-Innowax FSC1495.Tabanca, Demirci, et al., 200560. m/0.25 mm/0.25 μm, He; Program: 60C(10min) => 4C/min => 220C(10min) => 1C/min => 240C
CapillaryCarbowax 20M1495.Vinogradov, 2004Program: not specified
CapillaryHP-Innowax FSC1495.Demirci, Baser, et al., 200360. m/0.25 mm/0.25 μm, He; Program: 60C (10min) => 4C/min => 220C (10min) => 1C/min => 240C
CapillaryHP-Innowax1495.Baser, Demirci, et al., 200260. m/0.25 mm/0.25 μm, He; Program: 60 0C (10 min) 4 K/min -> 220 0C (10 min) 1 K/min -> 240 0C
CapillaryInnowax FSC1495.Baser, Demirei, et al., 200260. m/0.25 mm/0.25 μm, He; Program: 60C(10min) => 4C/min => 220C(10min) => 1C/min => 240C
CapillaryHP-Innowax FSC1495.Kirimer N., Tabanea N., et al., 200160. m/0.25 mm/0.25 μm, He; Program: 60C(10min) => 4C/min => 220C(10min) => 1C/min => 240C
CapillaryInnowax FSC1495.Tabanca N., Demirci F., et al., 200160. m/0.25 mm/0.25 μm, He; Program: 60C(10min) => 4C/min => 220C(10min) => 1C/min => 240C
CapillaryInnowax1487.Baser, Özek, et al., 200060. m/0.25 mm/0.25 μm, He; Program: 60 0C (10 min) 4 K/min -> 220 0C (10 min) 1 K/min -> 240 0C
CapillaryInnowax FSC1495.Kirimer, Tabanca, et al., 199960. m/0.25 mm/0.25 μm, Helium; Program: 60 0C (10 min) 4 0C/min -> 220 0C (10 min) 1 0C/min -> 240 0C

References

Siani, Garrido, et al., 2004
Siani, A.C.; Garrido, I.S.; Monteiro, S.S.; Carvalho, E.S.; Ramos, M.F.S., Protium icicariba as a source of volatile essences, Biochem. Syst. Ecol., 2004, 32, 5, 477-489, https://doi.org/10.1016/j.bse.2003.11.003 . [all data]

Paolini J., Costa J., et al., 2007
Paolini J.; Costa J.; Bernardini A.F., Analysis of the essential oil from the roots of Eupatorium cannabinum subsp corsicum (L.) by GC, GC-MS and C-13-NMR, Phytochem. Anal., 2007, 18, 3, 235-244, https://doi.org/10.1002/pca.977 . [all data]

Paolini, Muselli, et al., 2007
Paolini, J.; Muselli, A.; Bernardini, A.-F.; Bighelli, A.; Casanova, J.; Costa, J., Thymol derivatives from essential oil of Doronicum corsicum L., Flavour Fragr. J., 2007, 22, 6, 479-487, https://doi.org/10.1002/ffj.1824 . [all data]

Radulovic, Lazarevic, et al., 2007
Radulovic, N.; Lazarevic, J.; Ristic, N.; Palic, R., Chemotaxonomic significance of the volatiles in the genus Stachys (Lamiaceae): Essential oil composition of four Balkan Stachys species, Biochem. Syst. Ecol., 2007, 35, 4, 196-208, https://doi.org/10.1016/j.bse.2006.10.010 . [all data]

Brantner, Pfeifhofer, et al., 2005
Brantner, A.H.; Pfeifhofer, H.W.; Ercegovac, O.; Males, Z.; Plazibat, M., Essential oil composition and antioxidant activity of Thymus bracteosus Vis. ex Benth., Flavour Fragr. J., 2005, 20, 6, 596-600, https://doi.org/10.1002/ffj.1494 . [all data]

Idzojtic, Kajba, et al., 2005
Idzojtic, M.; Kajba, D.; Franjic, J., Differentiation of F1 hybrids P. nigra J. F. Arnold × P. sylvestris L., P. nigra J. F. Arnold × P. densiflora Siebold et Zucc., P. nigra J. F. Arnold × P. thunbergiana Franco and their parental species by needle volatile composition, Biochem. Syst. Ecol., 2005, 33, 4, 427-439, https://doi.org/10.1016/j.bse.2004.10.008 . [all data]

Paolini, Costa, et al., 2005
Paolini, J.; Costa, J.; Bernardini, A., Analysis of the essential oil from aerial parts of Eupatorium cannabinum subsp. corsicum (L.) by gas chromatography with electron impact and chemical ionization mass spectrometry, J. Chromatogr. A, 2005, 1076, 1-2, 170-178, https://doi.org/10.1016/j.chroma.2005.03.131 . [all data]

Seo and Baek, 2005
Seo, W.H.; Baek, H.H., Identification of characteristic aroma-active compounds from water dropword (Oenanthe javanica DC.), J. Agric. Food Chem., 2005, 53, 17, 6766-6770, https://doi.org/10.1021/jf050150z . [all data]

Vérité, Nacer, et al., 2004
Vérité, P.; Nacer, A.; Kabouche, Z.; Seguin, E., Composition of seeds and stems essential oils of Pituranthos scoparius (Coss. Dur.) Schinz, Flavour Fragr. J., 2004, 19, 6, 562-564, https://doi.org/10.1002/ffj.1353 . [all data]

Heinrich, Pfeifhofer, et al., 2002
Heinrich, G.; Pfeifhofer, H.W.; Stabentheiner, E.; Sawidis, T., Glandular hairs of Sigesbeckia jorullensis Kunth (Asteraceae): morphology, histochemistry and composition of essential oil, Ann. Bot. Rome, 2002, 89, 4, 459-469, retrieved from http://www.aob.oupjournals.org, https://doi.org/10.1093/aob/mcf062 . [all data]

Pala-Paul, Copeland, et al., 2006
Pala-Paul, J.; Copeland, L.M.; Brophy, J.J.; Goldsack, R.J., Essential oil composition of two variants of Prostanthera lasianthos Labill. from Australia, Biochem. Syst. Ecol., 2006, 34, 1, 48-55, https://doi.org/10.1016/j.bse.2005.04.003 . [all data]

Brophy, Goldsack, et al., 2004
Brophy, J.J.; Goldsack, R.J.; O'Sullivan, W., Chemistry of the Australian gymnosperms. Part VII. The leaf oils of the genus Actinostrobus, Biochem. Syst. Ecol., 2004, 32, 10, 867-873, https://doi.org/10.1016/j.bse.2004.05.001 . [all data]

Brophy, Goldsack, et al., 2000
Brophy, J.J.; Goldsack, R.J.; Forster, P.I., Essential oils of the genus Lophostemon (Myrtaceae), Flavour Fragr. J., 2000, 15, 1, 17-20, https://doi.org/10.1002/(SICI)1099-1026(200001/02)15:1<17::AID-FFJ859>3.0.CO;2-D . [all data]

Brophy, Goldsack, et al., 2000, 2
Brophy, J.; Goldsack, R.J.; Bean, A.R.; Forster, P.I.; Lepschi, B.J., Leaf essential oils of the genus Leptospermum (Myrtaceae) in eastern Australia. Part 6. Leptospermum polygalifolium and allies, Flavour Fragr. J., 2000, 15, 4, 271-277, https://doi.org/10.1002/1099-1026(200007/08)15:4<271::AID-FFJ910>3.0.CO;2-E . [all data]

Brophy, Goldsack, et al., 2000, 3
Brophy, J.J.; Goldsack, R.J.; Punruckvong, A.; Bean, A.R.; Forster, P.I.; Lepschi, B.J.; Doran, J.C.; Rozefelds, A.C., Leaf essential oils of the genus Leptospermum (Myrtaceae) in eastern Australia. Part 7. Leptospermum petersonii, L. liversidgei and allies, Flavour Fragr. J., 2000, 15, 5, 342-351, https://doi.org/10.1002/1099-1026(200009/10)15:5<342::AID-FFJ924>3.0.CO;2-V . [all data]

Brophy, Goldsack, et al., 1999
Brophy, J.J.; Goldsack, R.J.; Punruckvong, A.; Forster, P.I., The leaf essential oils of Pilidiostigma (Myrtaceae), Flavour Fragr. J., 1999, 14, 2, 143-146, https://doi.org/10.1002/(SICI)1099-1026(199903/04)14:2<143::AID-FFJ798>3.0.CO;2-P . [all data]

Brophy, Goldsack, et al., 1999, 2
Brophy, J.J.; Goldsack, R.J.; Bean, A.R.; Forster, P.I.; Lepschi, B.J., Leaf essential oils of the genus Leptospermum (Myrtaceae) in eastern Australia. Part 5. Leptospermum continentale and allies, Flavour Fragr. J., 1999, 14, 2, 98-104, https://doi.org/10.1002/(SICI)1099-1026(199903/04)14:2<98::AID-FFJ797>3.0.CO;2-V . [all data]

Brophy, Forster, et al., 1998
Brophy, J.J.; Forster, P.I.; Goldsack, R.J., Esssential oils of some Australian monimiaceae, Flavour Fragr. J., 1998, 13, 4, 273-276, https://doi.org/10.1002/(SICI)1099-1026(1998070)13:4<273::AID-FFJ745>3.0.CO;2-O . [all data]

Brophy, Forster, et al., 1998, 2
Brophy, J.J.; Forster, P.I.; Goldsack, R.J., The essential oils of three unusual Eucalypts: Eucalyptus curtisii, E. rubiginosa and E. tenuipes (Myrtaceae), Flavour Fragr. J., 1998, 13, 2, 87-89, https://doi.org/10.1002/(SICI)1099-1026(199803/04)13:2<87::AID-FFJ699>3.0.CO;2-Y . [all data]

Brophy, Goldsack, et al., 1998
Brophy, J.J.; Goldsack, R.J.; Forster, P.I.; Bean, A.R.; Clarkson, J.R.; Lepschi, B.J., Leaf essential oils of the genus Leptospermum (Myrtaceae) in Eastern Australia. Part 1. Leptospermum brachyandrum and Leptospermum pallidum groups, Flavour Fragr. J., 1998, 13, 1, 19-25, https://doi.org/10.1002/(SICI)1099-1026(199801/02)13:1<19::AID-FFJ679>3.0.CO;2-9 . [all data]

Brophy, Goldsack, et al., 1998, 2
Brophy, J.J.; Goldsack, R.J.; Bean, A.R.; Forster, P.I.; Lepschi, B.J., Leaf essential oils of the genus Leptospermum (Myrtaceae) in eastern Australia. Part 2. Leptospermum blakelyi and allies, Flavour Fragr. J., 1998, 13, 5, 353-358, https://doi.org/10.1002/(SICI)1099-1026(1998090)13:5<353::AID-FFJ759>3.0.CO;2-1 . [all data]

Brophy, Goldsack, et al., 1997
Brophy, J.J.; Goldsack, R.J.; Forster, P.I., The essential oils of the Australian species of Rhodomyrtus (Myrtaceae), Flavour Fragr. J., 1997, 12, 2, 103-108, https://doi.org/10.1002/(SICI)1099-1026(199703)12:2<103::AID-FFJ621>3.0.CO;2-B . [all data]

Brophy, Goldsack, et al., 1997, 2
Brophy, J.J.; Goldsack, R.J.; Forster, P.I., The leaf essential oils of the Australian species of Rhodamnia (Myrtaceae), Flavour Fragr. J., 1997, 12, 5, 345-354, https://doi.org/10.1002/(SICI)1099-1026(199709/10)12:5<345::AID-FFJ658>3.0.CO;2-6 . [all data]

Granicher, Christen, et al., 1995
Granicher, F.; Christen, P.; Kapetanidis, I., Essential oils from normal and hairy roots of valeriana officinalis var. sambucifolia, Phytochemistry, 1995, 40, 5, 1421-1424, https://doi.org/10.1016/0031-9422(95)00492-P . [all data]

Radulovic, Dordevic, et al., 2010
Radulovic, N.S.; Dordevic, N.D.; Palic, R.M., Volatiles of Pleurospermum austriacum (L.) Hoffm. (Apiaceae), J. Serbian Chem. Soc., 2010, 75, 12, 1-11, https://doi.org/10.2298/JSC100323127R . [all data]

Shimizu, Imayoshi, et al., 2009
Shimizu, Y.; Imayoshi, Y.; Kato, M.; Maeda, K.; Iwabuchi, H.; Shimomura, K., Volatiles from leaves of field-grown plants and shoot cultures of Gynura bicolor DC, Flavour Fragr. J., 2009, 24, 5, 251-258, https://doi.org/10.1002/ffj.1938 . [all data]

Lo Presti, Sciarrone, et al., 2008
Lo Presti, M.; Sciarrone, D.; Crupi, M.C.; Costa, R.; Ragusa, S.; Dugo, G.; Mondello, L., Evaliation of the volatile and chiral composition in Pistacia lentiscus L. essential oil, Flavour Fragr. J., 2008, 23, 4, 249-257, https://doi.org/10.1002/ffj.1878 . [all data]

Yassa and Akhani, 2008
Yassa, N.; Akhani, H., The essential oils composition in two species of the genus Eriocycla Lindl. (Apiaceae) from Iran, 2008, retrieved from http://biology.ut.ac.ir/members/akhani/PdfReprintNumber/27.pdf. [all data]

Ferhat, Tigrine-Kordjani, et al., 2007
Ferhat, M.A.; Tigrine-Kordjani, N.; Chemat, S.; Meklati, B.Y.; Chemat, F., Rapid Extraction of Volatile Compounds Using a New Simultaneous Microwave Distillation: Solvent Extraction Device, Chromatographia, 2007, 65, 3-4, 217-222, https://doi.org/10.1365/s10337-006-0130-5 . [all data]

Sonboli, Kanani, et al., 2007
Sonboli, A.; Kanani, M.R.; Yousefzadi, M.; Mojarrad, M., Biological activity and composition of the essential oil of Tetrataenium nephrophyllum (Apiaceae) from Iran, Natural Product Communications, 2007, 2, 12, 1249-1252. [all data]

Yassa and Akhani, 2007
Yassa, N.; Akhani, H., The essential oils composition in two species of the genus Eriocycla Lindl. (Apiaceae) from Iran, 2007, retrieved from http://biology.ut.ac.ir/members/akhani/PdfReprintNumber/27.pdf. [all data]

Ebrahim Sajjadi and Mehregan, 2006
Ebrahim Sajjadi, S.; Mehregan, I., Volatile constituents of flowers and leaves of Anthemis hyalina, Chem. Nat. Compd. (Engl. Transl.), 2006, 42, 5, 531-533, https://doi.org/10.1007/s10600-006-0207-2 . [all data]

Figuérédo, Cabassu, et al., 2006
Figuérédo, G.; Cabassu, P.; Chalchat, J.-C.; Pasquier, B., Studies of Mediterranean oregano populations. VIII. Chemical composition of essential oils of oreganos of various origins, Flavour Fragr. J., 2006, 21, 1, 134-139, https://doi.org/10.1002/ffj.1543 . [all data]

Kucuk, Gulec, et al., 2006
Kucuk, M.; Gulec, C.; Yasar, A.; Ucuncu, O.; Yayh, N.; Coskuncelebi, K.; Terzioglu, S.; Yayh, N., Chemical composition and antimicrobial activities of the essential oils of Teucrium chamaedrys subsp. chamaedrys, T. orientale var. puberulens, and T. chamaedrys subsp. lydium, Pharm. Biol., 2006, 44, 8, 592-599, https://doi.org/10.1080/13880200600896868 . [all data]

Nickavar B., Kamalinejad M., et al., 2006
Nickavar B.; Kamalinejad M.; Mohandesi S., Comparison of the components of the essential oils from leaves and fruits of Grammosciadium platycarpum, Chem. Nat. Compd. (Engl. Transl.), 2006, 42, 6, 686-688, https://doi.org/10.1007/s10600-006-0252-x . [all data]

Tesso, König, et al., 2006
Tesso, H.; König, W.A.; Son, P.T.; Giang, P.M., Composition of the essential oil of flowers of Chloranthus spicatus (Thunb.) Makino, Flavour Fragr. J., 2006, 21, 4, 592-597, https://doi.org/10.1002/ffj.1528 . [all data]

Sajjadi S.E. and Eskandari B., 2005
Sajjadi S.E.; Eskandari B., Chemical constituents of the essential oil of Nepeta oxyodonta, Chem. Nat. Compd. (Engl. Transl.), 2005, 41, 2, 175-177, https://doi.org/10.1007/s10600-005-0106-y . [all data]

Sajjadi and Ghannadi, 2005
Sajjadi, S.-E.; Ghannadi, A., Essential oil of the Persian sage, Salvia rhytidea Benth., Acta Pharm. Sin., 2005, 55, 321-326. [all data]

Mazloomifar, Saber-Tehrani, et al., 2003
Mazloomifar, H.; Saber-Tehrani, M.; Rustaiyan, A.; Masoudi, S., Chemical composition of the essential oil of Ajuga chamaecistus Ging. ssp. chamaecistus from Iran, J. Essent. Oil Res., 2003, 15, 1, 17-18, https://doi.org/10.1080/10412905.2003.9712250 . [all data]

Sajjadi and Mehregan, 2003
Sajjadi, S.E.; Mehregan, I., Chemical composition of the essential oil of Prangos Asperula Boiss. subsp. haussknechtii (Boiss.) Hernst. et Heyn fruits, 2003, retrieved from http://www1.tums.ac.ir/daru/daru2%2020003/Dr%20Sajadi.PDF. [all data]

Oyedeji, Olawore, et al., 1999
Oyedeji, A.O.; Olawore, O.N.; Ekundayo, O.; Koenig, W.A., Volatile leaf oil constituents of three Eucalyptus species from Nigeria, Flavour Fragr. J., 1999, 14, 4, 241-244, https://doi.org/10.1002/(SICI)1099-1026(199907/08)14:4<241::AID-FFJ820>3.0.CO;2-Y . [all data]

Rustaiyan, Masoudi, et al., 1999
Rustaiyan, A.; Masoudi, S.; Monfared, A.; Komeilizadeh, H., Volatile constituents of three Salvia species grown wild in Iran, Flavour Fragr. J., 1999, 14, 5, 276-278, https://doi.org/10.1002/(SICI)1099-1026(199909/10)14:5<276::AID-FFJ825>3.0.CO;2-Y . [all data]

Courtois, Paine, et al., 2009
Courtois, E.A.; Paine, C.E.; Blandinieres, P.-A.; Stien, D.; Bessiere, J.-M.; Houel, E.; Baraloto, C.; Chave, J., Diversity of the volatile organic compounds emitted by 55 species of tropical trees: a survey in French Guiana, J. Chem. Ecol., 2009, 35, 11, 1349-1362, https://doi.org/10.1007/s10886-009-9718-1 . [all data]

Novak, Draxler, et al., 2005
Novak, J.; Draxler, L.; Göhler, I.; Franz, C.M., Essential oil composition of Vitex agnus-castus - comparison of accessions and different plant organs, Flavour Fragr. J., 2005, 20, 2, 186-192, https://doi.org/10.1002/ffj.1404 . [all data]

Ka, Choi, et al., 2005
Ka, M.-H.; Choi, E.H.; Chun, H.-S.; Lee, K.-G., Antioxidative Activity of Volatile Extracts Isolated from Angelica tenuissimae Roots, Peppermint Leaves, Pine Needles, and Sweet Flag Leaves, J. Agric. Food Chem., 2005, 53, 10, 4124-4129, https://doi.org/10.1021/jf047932x . [all data]

Palá-Paúl, Brophy, et al., 2004
Palá-Paúl, J.; Brophy, J.J.; Goldsack, R.J.; Fontaniella, B., Analysis of the volatile components of Lavandula canariensis (L.) Mill., a Canary Islands endemic species, growing in Australia, Biochem. Syst. Ecol., 2004, 32, 1, 55-62, https://doi.org/10.1016/S0305-1978(03)00177-7 . [all data]

Dunlop, Bignell, et al., 1999
Dunlop, P.J.; Bignell, C.M.; Brooker, M.I.H.; Brophy, J.J.; Hibbert, D.B., Use of gas chromatograms of essential leaf oils to compare eight taxa of genus Angophora (Myrtaceae): possible relationships to the genus Eucalyptus, Biochem. Syst. Ecol., 1999, 27, 8, 815-830, https://doi.org/10.1016/S0305-1978(99)00022-8 . [all data]

Bignell, Dunlop, et al., 1998
Bignell, C.M.; Dunlop, P.J.; Brophy, J.J., Volatile leaf oils of some South-Western and Southern Australian species of the genus Eucalyptus (Series 1). Part XIX, Flavour Fragr. J., 1998, 13, 2, 131-139, https://doi.org/10.1002/(SICI)1099-1026(199803/04)13:2<131::AID-FFJ710>3.0.CO;2-X . [all data]

Bignell, Dunlop, et al., 1997
Bignell, C.M.; Dunlop, P.J.; Brophy, J.J.; Fookes, C.J.R., Volatile leaf oils of some South-Western and Southern Australian species of the genus Eucalyptus (Series I). Part XIV: Subgenus Monocalyptus, Flavour Fragr. J., 1997, 12, 3, 177-183, https://doi.org/10.1002/(SICI)1099-1026(199705)12:3<177::AID-FFJ626>3.0.CO;2-9 . [all data]

Bignell, Dunlop, et al., 1997, 2
Bignell, C.M.; Dunlop, P.J.; Brophy, J.J., Volatile leaf oils of some South-Western and Southern Australian species of the genus Eucalyptus (Series I). Part XV: Subgenus symphyomyrtus, section bisectaria, series levispermae, Flavour Fragr. J., 1997, 12, 3, 185-193, https://doi.org/10.1002/(SICI)1099-1026(199705)12:3<185::AID-FFJ627>3.0.CO;2-B . [all data]

Bignell, Dunlop, et al., 1997, 3
Bignell, C.M.; Dunlop, P.J.; Brophy, J.J., Volatile leaf oils of some South-Western and Southern Australian species of the genus Eucalyptus (Series I). Part XVI: Subgenus symphyomyrtus, section bisectaria, series cneorifoliae, series porantherae and series falcatae, Flavour Fragr. J., 1997, 12, 261-267. [all data]

Bignell, Dunlop, et al., 1997, 4
Bignell, C.M.; Dunlop, P.J.; Brophy, J.J., Volatile leaf oils of some Queensland and Norther Australian species of the genus Eucalyptus (Series II) Part II. Subgenera (a) Blakella, (b) Corymbia, (c) Unnamed, (d) Idiogenes, (e) Monocalyptus and (f) Symphyomyrtus, Flavour Fragr. J., 1997, 12, 4, 277-284, https://doi.org/10.1002/(SICI)1099-1026(199707)12:4<277::AID-FFJ642>3.0.CO;2-B . [all data]

Bignell, Dunlop, et al., 1997, 5
Bignell, C.M.; Dunlop, P.J.; Brophy, J.J., Volatile leaf oils of some south-western and southern Australian speices of the genus Eucalyptus (Series I). Part XVIII. A. Subgenus monocalyptus. B. Subgenus Symphyomyrtus: (i) section Guilfoyleanae; (ii) section bisectaria, series accedentes, series occidentales, series levispermae, series loxophlebae, series macrocarpae, series orbifoliae, series calycogonae; (iii) section dumaria, series incrassatae and series ovulares, Flavour Fragr. J., 1997, 12, 423-432. [all data]

Brophy, Goldsack, et al., 1996
Brophy, J.J.; Goldsack, R.J.; Bean, A.R.; Forster, P.I.; Fookes, C.J.R., The leaf essential oils of the genus Syncarpia ten. (Myrtaceae), Flavour Fragr. J., 1996, 11, 6, 361-366, https://doi.org/10.1002/(SICI)1099-1026(199611)11:6<361::AID-FFJ591>3.0.CO;2-T . [all data]

Gaydou, Faure, et al., 1989
Gaydou, E.M.; Faure, R.; Bianchini, J.-P.; Lamaty, G.; Rakotonirainy, O.; Randriamiharisoa, R., Sesquiterpene composition of basil oil. Assignment of the 1H and 13C NMR spectra of β-elemene with two-dimensional NMR, J. Agric. Food Chem., 1989, 37, 4, 1032-1037, https://doi.org/10.1021/jf00088a048 . [all data]

Kaya, Benirci, et al., 2007
Kaya, A.; Benirci, B.; Baser, K.H.C., Micromorphology of glandular trichomes of Nepeta congesta Fisch. Mey. var. congesta (LAmiaceae) and chemical analysis of the essential oils, South African J. Botany, 2007, 73, 1, 29-34, https://doi.org/10.1016/j.sajb.2006.05.004 . [all data]

Baser, Özek, et al., 2006
Baser, K.H.C.; Özek, G.; Özek, T.; Duran, A.; Duman, H., Composition of the essential oils of Rhabdosciadium oligocarpum (Post ex Boiss.) Hedge et Lamond and Rhabdosciadium microcalycinum Hand.-Mazz., Flavour Fragr. J., 2006, 21, 4, 650-655, https://doi.org/10.1002/ffj.1639 . [all data]

Duman, Kartal, et al., 2005
Duman, H.; Kartal, M.; Altun, L.; Demirci, B.; Baser, K.H.C., The essential oil of Stachys laetivirens Kotschy Boiss. ex Rech. fil., endemic in Turkey, Flavour Fragr. J., 2005, 20, 1, 48-50, https://doi.org/10.1002/ffj.1362 . [all data]

Tabanca, Demirci, et al., 2005
Tabanca, N.; Demirci, B.; Kirimer, N.; Baser, K.H.C.; Bedir, E.; Khand, I.A.; Wedge, D.E., Gas chromatographic-mass spectrometric analysis of essential oils from Pimpinella aurea, Pimpinella corymbosa, Pimpinella peregrina and Pimpinella puberula gathered from Eastern and Southern Turkey, J. Chromatogr. A, 2005, 1097, 1-2, 192-198, https://doi.org/10.1016/j.chroma.2005.10.047 . [all data]

Vinogradov, 2004
Vinogradov, B.A., Production, composition, properties and application of essential oils, 2004, retrieved from http://viness.narod.ru. [all data]

Demirci, Baser, et al., 2003
Demirci, B.; Baser, K.H.C.; Yildiz, B.; Bahcecioglu, Z., Composition of the essential oils of six endemic Salvia spp. from Turkey, Flavour Fragr. J., 2003, 18, 2, 116-121, https://doi.org/10.1002/ffj.1173 . [all data]

Baser, Demirci, et al., 2002
Baser, K.H.C.; Demirci, B.; Kirimer, N.; Satil, F.; Tumen, G., The essential oils of Thymus migricus and T. fedtschenkoi var. handelii from Turkey, Flavour Fragr. J., 2002, 17, 1, 41-45, https://doi.org/10.1002/ffj.1036 . [all data]

Baser, Demirei, et al., 2002
Baser, K.H.C.; Demirei, B.; Özek, T.; Akalin, E.; Özhatay, N., Micro-distilled volatile compounds from Ferulago species growing in Western Turkey, Pharm. Biol., 2002, 40, 6, 466-471, https://doi.org/10.1076/phbi.40.6.466.8439 . [all data]

Kirimer N., Tabanea N., et al., 2001
Kirimer N.; Tabanea N.; Demirci B.; Baser K.H.C.; Duman H.; Aytac Z., The essential oil of a new Sideritis species: Sideritis ozturkii Aytac and Aksoy, Chem. Nat. Compd. (Engl. Transl.), 2001, 37, 3, 234-237, https://doi.org/10.1023/A:1012561806033 . [all data]

Tabanca N., Demirci F., et al., 2001
Tabanca N.; Demirci F.; Ozek T.; Tumen G.; Baser K.H.C., Composition and antimicrobial activity of the essential oil of Origanum x dolichosiphon P. H. Davis, Chem. Nat. Compd. (Engl. Transl.), 2001, 37, 3, 238-241, https://doi.org/10.1023/A:1012513922871 . [all data]

Baser, Özek, et al., 2000
Baser, K.H.C.; Özek, T.; Demirci, B.; Duman, H., Composition of the essential oil of Prangos heyniae H. Duman et M. F. Watson, a new endemic from Turkey, Flavour Fragr. J., 2000, 15, 1, 47-49, https://doi.org/10.1002/(SICI)1099-1026(200001/02)15:1<47::AID-FFJ869>3.0.CO;2-9 . [all data]

Kirimer, Tabanca, et al., 1999
Kirimer, N.; Tabanca, N.; Ozek, T.; Basher, K.H.C.; Tumen, G., Composition of essential oils from two endemic Sideritis species of Turkey, Chem. Natural Comp., 1999, 35, 1, 61-64, https://doi.org/10.1007/BF02238211 . [all data]