dipropionyl peroxide

Condensed phase thermochemistry data

Data compiled by: Hussein Y. Afeefy, Joel F. Liebman, and Stephen E. Stein

Quantity Value Units Method Reference Comment
Δfliquid-620.1 ± 6.7kJ/molCcbJaffe, Prosen, et al., 1957
Quantity Value Units Method Reference Comment
Δcliquid-3170.2 ± 5.9kJ/molCcbJaffe, Prosen, et al., 1957Corresponding Δfliquid = -620.0 kJ/mol (simple calculation by NIST; no Washburn corrections)

References

Jaffe, Prosen, et al., 1957
Jaffe, L.; Prosen, E.J.; Szwarc, M., Heats of combustion of some peroxides and the heats of formation of acetate, propionate, and butyrate radicals, J. Chem. Phys., 1957, 27, 416-420. [all data]