Benzeneethanamine, N-(phenylmethylene)-

Normal alkane RI, polar column, custom temperature program

Data compiled by: NIST Mass Spectrometry Data Center, William E. Wallace, director

Column type Capillary
Active phase EC-1000
Column length (m)
Carrier gas
Substrate
Column diameter (mm)
Phase thickness (μm)
Program not specified
I 2560.
ReferenceDelabre and Bendall, 9999
Comment MSDC-RI

References

Delabre and Bendall, 9999
Delabre, M.-L.; Bendall, J.F., Flavour ingredients from fermented dairy streams, Expression of Multidisciplinary Flavour Sci., 9999, 375-378. [all data]