Tert-butyl(phenylacetylenyl)ketone

Phase change data

Data compiled as indicated in comments:
TRC - Thermodynamics Research Center, NIST Boulder Laboratories, Chris Muzny director
ALS - Hussein Y. Afeefy, Joel F. Liebman, and Stephen E. Stein

Quantity Value Units Method Reference Comment
Tboil402.KN/APimenova, Kozina, et al., 1986Uncertainty assigned by TRC = 0.1 K; error was assumed to be on the last digit.; TRC
Quantity Value Units Method Reference Comment
Δvap65.7kJ/molEPimenova, Kozina, et al., 1986, 2ALS
Δvap65.67kJ/molESiretskaya, Takhistov, et al., 1986ALS

In addition to the Thermodynamics Research Center (TRC) data available from this site, much more physical and chemical property data is available from the following TRC products:

References

Pimenova, Kozina, et al., 1986
Pimenova, S.M.; Kozina, M.P.; Gal'chenko, G.L.; Siretskaya, T.V.; Takhistov, V.V.; Kuznetsova, T.S.; Proskurnina, M.V.; Kotel'nikova, T.A., Heats of combustion and formation of some compounds with acetylene binding, Termodin. Org. Soedin., 1986, 1986, 12. [all data]

Pimenova, Kozina, et al., 1986, 2
Pimenova, S.M.; Kozina, M.P.; Gal'chenko, G.L.; Siretskaya, T.V.; Takhistov, V.V.; Kuznetsova, T.S.; Proskurnina, M.V.; Kotel'nikova, T.A., Heats of combustion and formation of some compounds with acetylene bonding, Termodin. Org. Soedin., 1986, 12-16. [all data]

Siretskaya, Takhistov, et al., 1986
Siretskaya, T.V.; Takhistov, V.V.; Pimenova, S.M.; Orlov, V.M.; Pustobaev, V.N., Formation enthalpies of acetylene ketones fragments in gas phases, React. Kinet. Catal. Lett., 1986, 31, 15-19. [all data]