2-Propenoic acid, 2-methyl-, octadecyl ester

Kovats' RI, non-polar column, isothermal

View large format table.

Column type Active phase Temperature (C) I Reference Comment
CapillaryOV-101200.2359.Horna, Táborský, et al., 1985N2; Column length: 19. m; Column diameter: 0.28 mm

Kovats' RI, polar column, isothermal

View large format table.

Column type Active phase Temperature (C) I Reference Comment
CapillarySP-1000200.2645.Horna, Táborský, et al., 1985N2; Column length: 46. m; Column diameter: 0.23 mm

Van Den Dool and Kratz RI, non-polar column, custom temperature program

View large format table.

Column type Active phase I Reference Comment
Capillary5 % Phenyl methyl siloxane2377.Zaikin, 2007Column length: 30. m; Column diameter: 0.19 mm; Program: 20C => 5C/min => 120C => 10C/min => 280C

References

Horna, Táborský, et al., 1985
Horna, A.; Táborský, J.; Dufka, O.; Matousek, P.; Churácek, J., Chromatography of monomers. II. Glass capillary gas chromatography of C1-C18 alkyl esters of acrylic and methacrylic acids, J. Chromatogr., 1985, 325, 367-378, https://doi.org/10.1016/S0021-9673(00)96047-3 . [all data]

Zaikin, 2007
Zaikin, V.G., Personal Communication: Retention indices measured during the period 2006 to 2007 (I), 2007. [all data]