2-isopropyl-m-cresol

Gas phase thermochemistry data

Data compiled by: Hussein Y. Afeefy, Joel F. Liebman, and Stephen E. Stein

Quantity Value Units Method Reference Comment
Δfgas-41.0kcal/molCcbBertholon, Giray, et al., 1971

Condensed phase thermochemistry data

Data compiled by: Hussein Y. Afeefy, Joel F. Liebman, and Stephen E. Stein

Quantity Value Units Method Reference Comment
Δfsolid-65.kcal/molCcbBertholon, Giray, et al., 1971
Quantity Value Units Method Reference Comment
Δcsolid-1354.kcal/molCcbBertholon, Giray, et al., 1971Corresponding Δfsolid = -65. kcal/mol (simple calculation by NIST; no Washburn corrections)

Phase change data

Data compiled as indicated in comments:
TRC - Thermodynamics Research Center, NIST Boulder Laboratories, Chris Muzny director
ALS - Hussein Y. Afeefy, Joel F. Liebman, and Stephen E. Stein
DRB - Donald R. Burgess, Jr.

Quantity Value Units Method Reference Comment
Tboil501.65KN/ABert, 1959Uncertainty assigned by TRC = 3. K; TRC
Quantity Value Units Method Reference Comment
Tfus342.15KN/ABert, 1959Uncertainty assigned by TRC = 2. K; TRC
Tfus342.55KN/AHofer and Peebles, 1955Uncertainty assigned by TRC = 2. K; TRC
Quantity Value Units Method Reference Comment
Δsub23.96kcal/molCBertholon, Giray, et al., 1971ALS
Δsub23.4kcal/molN/ABertholon, Giray, et al., 1971DRB

In addition to the Thermodynamics Research Center (TRC) data available from this site, much more physical and chemical property data is available from the following TRC products:

References

Bertholon, Giray, et al., 1971
Bertholon, G.; Giray, M.; Perrin, R.; Vincent-Falquet-Berny, M.F., No. 532. - Etude physicochimique des phenols. OX. - Ethanlpies de combustion et energies de resonance des alcoyl et aryphenols, Bull. Soc. Chim. France, 1971, 3180-3187. [all data]

Bert, 1959
Bert, L., C. R. Hebd. Seances Acad. Sci., 1959, 249, 2788. [all data]

Hofer and Peebles, 1955
Hofer; Peebles, Anal. Chem., 1955, 27, 1852. [all data]