Cyclobuta[a]naphthalene,1,2-dihydro-

Gas phase ion energetics data

Data compiled by: Sharon G. Lias, Rhoda D. Levin, and Sherif A. Kafafi

Ionization energy determinations

IE (eV) Method Reference Comment
7.84 ± 0.03PESantiago, Gandour, et al., 1978Vertical value

References

Santiago, Gandour, et al., 1978
Santiago, C.; Gandour, R.W.; Houk, K.N.; Nutakul, W.; Cravey, W.E.; Thummel, R.P., Photoelectron and ultraviolet spectra of small-ring fused aromatic molecules as probes of aromatic ring distortions, J. Am. Chem. Soc., 1978, 100, 3730. [all data]