Pyrazine, 2,3-dimethyl-5-(1-methylpropyl)-

Normal alkane RI, non-polar column, temperature ramp

View large format table.

Column type Active phase I Reference Comment
CapillaryOV-1011194.Mihara and Masuda, 1987N2, 2. K/min; Column length: 50. m; Column diameter: 0.22 mm; Tstart: 80. C; Tend: 200. C

Normal alkane RI, polar column, temperature ramp

View large format table.

Column type Active phase I Reference Comment
CapillaryDB-Wax1540.Lin, Cai, et al., 200330. m/0.25 mm/0.25 μm, He, 50. C @ 2. min, 3. K/min, 230. C @ 20. min

Normal alkane RI, polar column, custom temperature program

View large format table.

Column type Active phase I Reference Comment
CapillaryCarbowax 20M1500.Mihara and Masuda, 1987Program: not specified

References

Mihara and Masuda, 1987
Mihara, S.; Masuda, H., Correlation between molecular structures and retention indices of pyrazines, J. Chromatogr., 1987, 402, 309-317, https://doi.org/10.1016/0021-9673(87)80029-8 . [all data]

Lin, Cai, et al., 2003
Lin, P.; Cai, J.; Li, J.; Sang, W.; Su, Q., Constituents of the essential oil of Hemerocallis flava day lily, Flavour Fragr. J., 2003, 18, 6, 539-541, https://doi.org/10.1002/ffj.1264 . [all data]