2,2',4,4',6-Pentanitrobenzophenone

Condensed phase thermochemistry data

Data compiled by: Hussein Y. Afeefy, Joel F. Liebman, and Stephen E. Stein

Quantity Value Units Method Reference Comment
Δfsolid-115. ± 5.0kJ/molCcbRouse, 1976
Quantity Value Units Method Reference Comment
Δcsolid-5716. ± 2.kJ/molCcbRouse, 1976

References

Rouse, 1976
Rouse, P.E., Jr., Enthalpies of formation and calculated detonation properties of some thermally stable explosives, J. Chem. Eng. Data, 1976, 21, 16-20. [all data]