C12H6F7NO2

Reaction thermochemistry data

Data compiled by: John E. Bartmess

Individual Reactions

C12H5F7NO2- + Hydrogen cation = C12H6F7NO2

By formula: C12H5F7NO2- + H+ = C12H6F7NO2

Quantity Value Units Method Reference Comment
Δr1288. ± 8.4kJ/molIMREKoppel, Koppel, et al., 2000gas phase

References

Koppel, Koppel, et al., 2000
Koppel, I.A.; Koppel, J.; Pihl, V.; Leito, I.; Mishima, M.; Vlasov, V.M.; Yagupolskii, L.M.; Taft, R.W., Comparison of Bronsted acidities of neutral CH acids in gas phase and dimethyl sulfoxide, J. Chem. Soc. Perkin Trans., 2000, 2, 6, 1125-1133, https://doi.org/10.1039/b001792m . [all data]