Caryophyllenol I

Normal alkane RI, polar column, custom temperature program

Data compiled by: NIST Mass Spectrometry Data Center, William E. Wallace, director

Column type CapillaryCapillaryCapillaryCapillaryCapillary
Active phase Innowax FSCHP-Innowax FSCHP Innowax FSPHP-Innowax FSCInnowax
Column length (m) 60.60.60.60.60.
Carrier gas HeliumN2N2HeHe
Substrate
Column diameter (mm) 0.250.250.250.250.25
Phase thickness (μm) 0.250.250.250.250.25
Program 60 0C (10 min) 4 0C/min -> 220 0C (10 min) 1 0C/min -> 240 0C60C(10min) => 4C/min => 220C => (10min) => 1C/min => 240C60C(10min) => 4C/min => 220C(10min) => 1C/min => 240C60C(10min) => 4C/min => 220C(10min) => 1C/min => 240C60C(10min) => 4C/min => 220C(10min) => 1C/min => 240C
I 2389.2389.2389.2389.2389.
ReferencePolatoglu, Demirci, et al., 2010Tabanca, Demirci, et al., 2006Altintas, Kose, et al., 2004Demirci, Dadandi, et al., 2003Baser, Nuriddinov, et al., 2002
Comment MSDC-RI MSDC-RI MSDC-RI MSDC-RI MSDC-RI
Column type Capillary
Active phase Innowax FSC
Column length (m) 60.
Carrier gas He
Substrate
Column diameter (mm) 0.25
Phase thickness (μm) 0.25
Program 60C(10min) => 4C/min => 220C(10min) => 1C/min => 240C
I 2353.
ReferenceTabanca N., Demirci F., et al., 2001
Comment MSDC-RI

References

Polatoglu, Demirci, et al., 2010
Polatoglu, K.; Demirci, F.; Demirci, B.; Goren, N.; Baser, K.H.C., Antimicrobial activity and essential oil composition of a new T. argyrophyllum (C. Koch) Tvzel var. argyrophyllium chemotype, J. Oleo Sci., 2010, 59, 6, 307-313, https://doi.org/10.5650/jos.59.307 . [all data]

Tabanca, Demirci, et al., 2006
Tabanca, N.; Demirci, B.; Can Baser, K.H.; Aytac, Z.; Ekici, M.; Khan, S.I.; Jacob, M.R.; Wedge, D.E., Chemical Composition and Antifungal Activity of Salvia macrochlamys and Salvia recognita Essential Oils, J. Agric. Food Chem., 2006, 54, 18, 6593-6597, https://doi.org/10.1021/jf0608773 . [all data]

Altintas, Kose, et al., 2004
Altintas, A.; Kose, Y.B.; Yucel, E.; Demirci, B.; Baser, K.H.C., Composition of the essential oil of Centaurea dichroa, Chem. Nat. Compd. (Engl. Transl.), 2004, 40, 6, 604-605, https://doi.org/10.1007/s10600-005-0051-9 . [all data]

Demirci, Dadandi, et al., 2003
Demirci, B.; Dadandi, M.Y.; Paper, D.H.; Franz, G.; Hüsnü Can Baser, K., Chemical Composition of the Essential Oil of Phlomis linearis Boiss. Bal., and Biological Effects on the CAM-Assay: A Safety Evaluation, Z. Naturforsch. C:, 2003, 58, 826-829. [all data]

Baser, Nuriddinov, et al., 2002
Baser, K.H.C.; Nuriddinov, H.R.; Ozek, T.; Demirci, A.B.; Azcan, N.; Nigmatullaev, A.M., Essential oil of Arischrada korolkowii from the Chatkal mountains of Uzbekistan, Chem. Nat. Compd. (Engl. Transl.), 2002, 38, 1, 51-53, https://doi.org/10.1023/A:1015729731464 . [all data]

Tabanca N., Demirci F., et al., 2001
Tabanca N.; Demirci F.; Ozek T.; Tumen G.; Baser K.H.C., Composition and antimicrobial activity of the essential oil of Origanum x dolichosiphon P. H. Davis, Chem. Nat. Compd. (Engl. Transl.), 2001, 37, 3, 238-241, https://doi.org/10.1023/A:1012513922871 . [all data]