C9H5ClN2

Reaction thermochemistry data

Data compiled by: John E. Bartmess

Individual Reactions

C9H4ClN2- + Hydrogen cation = C9H5ClN2

By formula: C9H4ClN2- + H+ = C9H5ClN2

Quantity Value Units Method Reference Comment
Δr314.7 ± 2.3kcal/molG+TSKoppel, Taft, et al., 1994gas phase
Quantity Value Units Method Reference Comment
Δr309.0 ± 2.0kcal/molIMREKoppel, Taft, et al., 1994gas phase

Gas phase ion energetics data

Data compiled by: John E. Bartmess

De-protonation reactions

C9H4ClN2- + Hydrogen cation = C9H5ClN2

By formula: C9H4ClN2- + H+ = C9H5ClN2

Quantity Value Units Method Reference Comment
Δr314.7 ± 2.3kcal/molG+TSKoppel, Taft, et al., 1994gas phase
Quantity Value Units Method Reference Comment
Δr309.0 ± 2.0kcal/molIMREKoppel, Taft, et al., 1994gas phase

References

Koppel, Taft, et al., 1994
Koppel, I.A.; Taft, R.W.; Anvia, F.; Zhu, S.Z.; Hu, L.Q.; Sung, K.S.; Desmarteau, D.D.; Yagupolskii, L.M., The Gas-Phase Acidities of Very Strong Neutral Bronsted Acids, J. Am. Chem. Soc., 1994, 116, 7, 3047, https://doi.org/10.1021/ja00086a038 . [all data]