endo-2-Methyl-2-norbornanol

Kovats' RI, polar column, isothermal

Data compiled by: NIST Mass Spectrometry Data Center, William E. Wallace, director

Column type Packed
Active phase Carbowax 20M
Column length (m) 2.
Carrier gas
Substrate Chromosorb W (60-80 mesh)
Column diameter (mm)
Phase thickness (μm)
Temperature (C) 140.
I 1469.
ReferenceHeintz, Gruselle, et al., 1976
Comment MSDC-RI

References

Heintz, Gruselle, et al., 1976
Heintz, M.; Gruselle, M.; Druilhe, A.; Lefort, D., Relations entre structure chimique et données de rétention en chromatographie en phase gaseuse. VI. Alcools et esters méthyliques de structures cycliques, Chromatographia, 1976, 9, 8, 367-372, https://doi.org/10.1007/BF02330385 . [all data]