Furan, 2-ethyl-

Normal alkane RI, polar column, custom temperature program

Data compiled by: NIST Mass Spectrometry Data Center, William E. Wallace, director

Column type CapillaryCapillaryCapillaryCapillaryCapillary
Active phase InnowaxSOLGel-WaxSOLGel-WaxSupelcowax-10Supelcowax-10
Column length (m) 30.30.30.30.30.
Carrier gas HeliumHeliumHeliumHeHe
Substrate
Column diameter (mm) 0.250.250.250.250.25
Phase thickness (μm) 0.250.250.250.250.25
Program not specified40 0C (2 min) 5 0C/min -> 140 0C 10 0C/min -> 250 0C (3 min)not specified35C(8min) => 6C/min => 60C => 4C/min => 160C => 20C/min => 200C(1min)35C(8min) => 6C/min => 60C => 4C/min => 160C => 20C/min => 200C(1min)
I 963.950.945.945.950.
ReferenceSiristova, Prinosilova, et al., 2012Johanningsmeier and McFeeters, 2011Johanningsmeier and McFeeters, 2011Berard, Bianchi, et al., 2007Berard, Bianchi, et al., 2007
Comment MSDC-RI MSDC-RI MSDC-RI MSDC-RI MSDC-RI
Column type CapillaryCapillaryCapillaryCapillaryCapillary
Active phase HP-InnowaxHP-InnowaxHP-InnowaxInnowax FSCDB-Wax
Column length (m) 30.30.30.60.60.
Carrier gas HeHeHeHeHelium
Substrate
Column diameter (mm) 0.250.250.250.250.25
Phase thickness (μm) 0.250.250.250.250.25
Program 30C(5min) => 7C/min => 100C(5min) => 1C/min => 130C => 10C/min => 195C(45min)30C(5min) => 7C/min => 100C(5min) => 1C/min => 130C => 10C/min => 195C(45min)30C(5min) => 7C/min => 100C(5min) => 1C/min => 130C => 10C/min => 195C(45min)60C(10min) => 4C/min => 220C(10min) => 1C/min => 240C60 0C (3 min) 2 0C/min -> 150 0C 4 0C/min -> 200 0C
I 936.945.945.965.953.
ReferenceNarain, Galvao, et al., 2007Narain, Galvao, et al., 2007Narain, Galvao, et al., 2007Baser, Özek, et al., 2004Kim. J.H., Ahn, et al., 2004
Comment MSDC-RI MSDC-RI MSDC-RI MSDC-RI MSDC-RI
Column type CapillaryCapillaryCapillaryCapillaryCapillary
Active phase Carbowax 20MSupelcowax 10Supelcowax 10Supelcowax 10CP-Wax 52CB
Column length (m)  60.60.60.50.
Carrier gas  HeliumHeliumHelium
Substrate
Column diameter (mm)  0.250.250.250.32
Phase thickness (μm)  0.250.250.251.5
Program not specified60 0C (10 min) 2 0C/min -> 80 0C 3 0C/min -> 100 0C 4 0C/min -> 220 0C (30 min)not specifiednot specified40C => 2C/min => 150C => 10C/min => 250C
I 951.946.947.949.944.
ReferenceVinogradov, 2004Castioni and Kapetanidis, 1996Castioni and Kapetanidis, 1996Castioni and Kapetanidis, 1996Luning, de Rijk, et al., 1994
Comment MSDC-RI MSDC-RI MSDC-RI MSDC-RI MSDC-RI

References

Siristova, Prinosilova, et al., 2012
Siristova, L.; Prinosilova, S.; Riddellova, K.; Hajslova, J.; Malzoch, K., Changes in quality parameters of vodka filtered through activated charcoal, Czech J. Food Sci., 2012, 30, 5, 474-482. [all data]

Johanningsmeier and McFeeters, 2011
Johanningsmeier, S.D.; McFeeters, R.F., Detection of volatile spoilage metabolites in fermented cucumbers using nontargeted, comprehensive 2-dimensional gas chromatography-time-of-flight mass spectrometry (GCxGCxTOFMS), J. Food Sci., 2011, 76, 1, c168-c177, https://doi.org/10.1111/j.1750-3841.2010.01918.x . [all data]

Berard, Bianchi, et al., 2007
Berard, J.; Bianchi, F.; Careri, M.; Chatel, A.; Mangia, A.; Musci, M., Characterization of the volatile fraction and of free fatty acids of Fontina Valle d'Aosta, a protected designation of origin Italian cheese, Food Chem., 2007, 105, 1, 293-300, https://doi.org/10.1016/j.foodchem.2006.11.041 . [all data]

Narain, Galvao, et al., 2007
Narain, N.; Galvao, M.S.; Madruga, M.S., Volatile compounds captured through purge and trap technique in caja-umbu (Spondias sp.) fruits during maturation, Food Chem., 2007, 102, 3, 726-731, https://doi.org/10.1016/j.foodchem.2006.06.003 . [all data]

Baser, Özek, et al., 2004
Baser, K.H.C.; Özek, T.; Kirimer, N.; Deliorman, D.; Ergun, F., Composition of the essential oils of Galium aparine L. and Galium odoratum (L.) Scop. from Turkey, J. Essent. Oil Res., 2004, 16, 4, 305-307, https://doi.org/10.1080/10412905.2004.9698728 . [all data]

Kim. J.H., Ahn, et al., 2004
Kim. J.H.; Ahn, H.J.; Yook, H.S.; Kim, K.S.; Rhee, M.S.; Ryu, G.H.; Byun, M.W., Color, flavor, and sensory characteristics of gamma-irradiated salted and fermented anchovy sauce, Radiation Phys. Chem., 2004, 69, 2, 179-187, https://doi.org/10.1016/S0969-806X(03)00400-6 . [all data]

Vinogradov, 2004
Vinogradov, B.A., Production, composition, properties and application of essential oils, 2004, retrieved from http://viness.narod.ru. [all data]

Castioni and Kapetanidis, 1996
Castioni, P.; Kapetanidis, I., Volatile constituents from Brunfelsia grandiflora ssp. grandiflora: qualitative analysis by GC-MS, Scientia Pharmaceutica, 1996, 64, 83-91. [all data]

Luning, de Rijk, et al., 1994
Luning, P.A.; de Rijk, T.; Wichers, H.J.; Roozen, J.P., Gas chromatography, mass spectrometry, and sniffing port analyses of volatile compounds of fresh bell peppers (Capsicum annuum) at different ripening stages, J. Agric. Food Chem., 1994, 42, 4, 977-983, https://doi.org/10.1021/jf00040a027 . [all data]