C2HNO2

Reaction thermochemistry data

Data compiled by: John E. Bartmess

Individual Reactions

C2NO2- + Hydrogen cation = C2HNO2

By formula: C2NO2- + H+ = C2HNO2

Quantity Value Units Method Reference Comment
Δr356.0 ± 4.3kcal/molG+TSSchmitt, Krempp, et al., 1992gas phase; acidity between MeSH, tBuSH.
Quantity Value Units Method Reference Comment
Δr348.2 ± 4.2kcal/molIMRBSchmitt, Krempp, et al., 1992gas phase; acidity between MeSH, tBuSH.

Gas phase ion energetics data

Data compiled by: John E. Bartmess

De-protonation reactions

C2NO2- + Hydrogen cation = C2HNO2

By formula: C2NO2- + H+ = C2HNO2

Quantity Value Units Method Reference Comment
Δr356.0 ± 4.3kcal/molG+TSSchmitt, Krempp, et al., 1992gas phase; acidity between MeSH, tBuSH.
Quantity Value Units Method Reference Comment
Δr348.2 ± 4.2kcal/molIMRBSchmitt, Krempp, et al., 1992gas phase; acidity between MeSH, tBuSH.

References

Schmitt, Krempp, et al., 1992
Schmitt, R.J.; Krempp, M.; Bierbaum, V.M., Gas Phase Chemistry of Dinitramide and Nitroacetylide Ions, Int. J. Mass Spectrom. Ion Proc., 1992, 117, 621, https://doi.org/10.1016/0168-1176(92)80116-I . [all data]