L-Histidine,N-[N-(1-oxodecyl)-L-alanyl]-methyl ester

Gas phase ion energetics data

Data compiled by: Sharon G. Lias, Rhoda D. Levin, and Sherif A. Kafafi

Ionization energy determinations

IE (eV) Method Reference
8.7 ± 0.1PIOrlov, Varshavsky, et al., 1974

Appearance energy determinations

Ion AE (eV) Other Products MethodReferenceComment
C13H24NO2+8.8 ± 0.1?PIOrlov, Varshavsky, et al., 1974
C13H25N2O2+9.1 ± 0.1?PIOrlov, Varshavsky, et al., 1974
C16H29N2O4+9.6 ± 0.1?PIOrlov, Varshavsky, et al., 1974

References

Orlov, Varshavsky, et al., 1974
Orlov, V.M.; Varshavsky, Y.M.; Miroshnikov, A.I., Photoionisation mass spectra of volatile derivatives of short peptides and appearance potentials of their characteristic ions, Org. Mass Spectrom., 1974, 9, 811. [all data]