4-Methyl-5-ethylthiazole

Normal alkane RI, non-polar column, temperature ramp

Data compiled by: NIST Mass Spectrometry Data Center, William E. Wallace, director

Column type Capillary
Active phase DB-1
Column length (m) 60.
Carrier gas He
Substrate
Column diameter (mm) 0.25
Phase thickness (μm) 1.0
Tstart (C) 40.
Tend (C) 260.
Heat rate (K/min) 2.
Initial hold (min) 5.
Final hold (min) 60.
I 1023.
ReferenceYu, Wu, et al., 1994
Comment MSDC-RI

References

Yu, Wu, et al., 1994
Yu, T.-H.; Wu, C.-M.; Ho, C.-T., Meat-like flavor generated from thermal interactions of glucose and alliin or deoxyalliin, J. Agric. Food Chem., 1994, 42, 4, 1005-1009, https://doi.org/10.1021/jf00040a032 . [all data]