o-Nitrobenzylidene-2-methylphenylacetonitrile

Condensed phase thermochemistry data

Data compiled by: Hussein Y. Afeefy, Joel F. Liebman, and Stephen E. Stein

Quantity Value Units Method Reference Comment
Δfsolid165.kJ/molCcbZavoianu, Contineanu, et al., 1987
Quantity Value Units Method Reference Comment
Δcsolid-8180.kJ/molCcbZavoianu, Contineanu, et al., 1987

References

Zavoianu, Contineanu, et al., 1987
Zavoianu, D.; Contineanu, I.; Moga-Gheorghe, S.; Marchidan, D.I., Structure and reactivity of nitriles. II. Condensing reactions of methyl and dimethylphenylacetonitriles with substituted aromatic aldehydes, Rev. Chim. (Bucharest), 1987, 38, 9-15. [all data]