3(2H)-Furanone, dihydro-2-methyl-

Normal alkane RI, polar column, custom temperature program

Data compiled by: NIST Mass Spectrometry Data Center, William E. Wallace, director

Column type CapillaryCapillaryCapillaryCapillaryCapillary
Active phase DB-WaxDB-WaxStabilwaxSupelcowax-10Supelcowax 10
Column length (m) 30.30.30.50.50.
Carrier gas HeliumHeliumHeliumHeliumHelium
Substrate
Column diameter (mm) 0.250.250.250.250.25
Phase thickness (μm) 0.250.250.250.250.25
Program not specifiednot specified35 0C 3 0C/min -> 100 0C 5 0C/min -> 240 0C (10 min)45 0C (15 min) 3 0C/min -> 75 0C 5 0C/min -> 180 0C (10 min)45 0C (15 min) 3 0C/min -> 75 0C 5 0C/min -> 180 0C (10 min)
I 1246.1260.1265.1271.1271.
ReferenceWelke, Manfroi, et al., 2012Welke, Manfroi, et al., 2012Chinnici, Guerrero, et al., 2009Soria, Martinez-Castro, et al., 2009Soria, Martinez-Castro, et al., 2008
Comment MSDC-RI MSDC-RI MSDC-RI MSDC-RI MSDC-RI
Column type CapillaryCapillaryCapillaryCapillary
Active phase Supelcowax 10DB-WaxDB-WaxCP-Wax 52CB
Column length (m) 50.30.30.50.
Carrier gas HeliumHydrogenHydrogen
Substrate
Column diameter (mm) 0.250.250.250.32
Phase thickness (μm) 0.250.250.251.2
Program 45 0C (15 min) 3 0C/min -> 75 0C 5 0C/min -> 180 0C (10 min)44 0C 3 0C/min -> 170 0C 8 0C/min -> 250 0Cnot specified40C(10min) => 3C/min => 190C => 10C/min => 250C(5min)
I 1271.1267.1283.1277.
ReferenceSoria, Martinez-Castro, et al., 2008Gonzalez-Rios, Suarez-Quiroz, et al., 2007Gonzalez-Rios, Suarez-Quiroz, et al., 2007Muresan, Eillebrecht, et al., 2000
Comment MSDC-RI MSDC-RI MSDC-RI MSDC-RI

Van Den Dool and Kratz RI, polar column, custom temperature program

Data compiled by: NIST Mass Spectrometry Data Center, William E. Wallace, director

Column type CapillaryCapillaryCapillaryCapillaryCapillary
Active phase Supelcowax-10Supelcowax-10Supelcowax-10CarbowaxCarbowax
Column length (m) 30.30.60.
Carrier gas HeHe
Substrate
Column diameter (mm) 0.250.250.250.30.3
Phase thickness (μm) 0.250.250.25
Program 35C(8min) => 4C/min => 60C => 6C/min => 160C => 20C/min => 200C(1min)35C(8min) => 4C/min => 60C => 6C/min => 160C => 20C/min => 200C(1min)20C(0.5min) => fast => 60C => 4C/min => 220Cnot specifiednot specified
I 1266.1288.1268.1248.1249.
ReferenceBianchi, Careri, et al., 2007Bianchi, Careri, et al., 2007Maignial, Pibarot, et al., 1992Baltes w. and Bochmann G., 1987Baltes w. and Bochmann G., 1987
Comment MSDC-RI MSDC-RI MSDC-RI MSDC-RI MSDC-RI
Column type CapillaryCapillary
Active phase CarbowaxCarbowax
Column length (m)
Carrier gas
Substrate
Column diameter (mm) 0.30.3
Phase thickness (μm)
Program not specifiednot specified
I 1250.1250.
ReferenceBaltes w. and Bochmann G., 1987Baltes w. and Bochmann G., 1987
Comment MSDC-RI MSDC-RI

Normal alkane RI, non-polar column, custom temperature program

Data compiled by: NIST Mass Spectrometry Data Center, William E. Wallace, director

Column type CapillaryCapillaryCapillaryCapillaryCapillary
Active phase SLB-5 MSSLB-5 MSSLB-5MSDB-5 MSHP-5MS
Column length (m) 30.30.10.30.30.
Carrier gas HeliumHeliumHeliumHeliumHe
Substrate
Column diameter (mm) 0.250.250.180.250.25
Phase thickness (μm) 0.250.250.180.250.25
Program not specifiednot specifiednot specified45 0C (0.75 min) 10 0C/min -> 200 0C 30 0C/min -> 245 0C (1.25 min)50C(2min) => 20C/min => 80C (1min) => 20C/min => 100C(1min) => 30C/min => 230C(3min)
I 806.812.806.810.806.
ReferenceMondello, 2012Mondello, 2012Risticevic, Carasek, et al., 2008Cajka, Hajslova, et al., 2007Ho, Wan Aida, et al., 2007
Comment MSDC-RI MSDC-RI MSDC-RI MSDC-RI MSDC-RI
Column type CapillaryCapillaryCapillaryCapillaryCapillary
Active phase DB-5 MSCP Sil 5 CBHP-5DB-5SE-30
Column length (m) 60.50.50.50.
Carrier gas Helium
Substrate
Column diameter (mm) 0.320.320.320.32
Phase thickness (μm) 1.01.21.051.05
Program 40 0C (2 min) 6 0C/min -> 100 0C 4 0C/min -> 180 0C 8 0C/min -> 250 0C (12 min)36C => 20C/min => 85C => 1C/min => 145C => 3C/min => 250C(30min)40C(10min) => 5C/min => 200C => 20C/min => 250C(5min)40C(10min) => 5C/min => 200C => 20C/min => 250C (5min)not specified
I 808.775.810.810.775.
ReferenceLiu, Xu, et al., 2007Counet, Ouwerx, et al., 2004Garcia-Estaban, Ansorena, et al., 2004Garcia-Estaban, Ansorena, et al., 2004, 2Vinogradov, 2004
Comment MSDC-RI MSDC-RI MSDC-RI MSDC-RI MSDC-RI
Column type CapillaryCapillary
Active phase BPX-5CP Sil 5 CB
Column length (m) 60.50.
Carrier gas He
Substrate
Column diameter (mm) 0.320.32
Phase thickness (μm) 1.1.2
Program 40C (4min) => 2C/min => 90C => 4C/min => 130C => 8C/min => 250 C (10min)36C => 20C/min => 85C => 1C/min => 145C=3C/min => 250C(30min)
I 808.781.
ReferenceMachiels, van Ruth, et al., 2003Counet, Callemien, et al., 2002
Comment MSDC-RI MSDC-RI

References

Welke, Manfroi, et al., 2012
Welke, J.E.; Manfroi, V.; Zanus, M.; Lazarotto, M.; Zini, C.A., Characterization of the volatile profile of Brazilian merlot wines through comprehensive two dimensional gas chromatography time-of-flight mass spectrometric detection, J. Chromatogr. A, 2012, 1226, 124-139, https://doi.org/10.1016/j.chroma.2012.01.002 . [all data]

Chinnici, Guerrero, et al., 2009
Chinnici, F.; Guerrero, E.D.; Sonni, F.; Natali, N.; Marin, R.N.; Riponi, C., Gas chromatography - mass spectrometry (GC-MS) characterization of volatile compounds in quality vinegars with protected Europian geographical indication, J. Agric. Food Chem., 2009, 57, 11, 4784-4792, https://doi.org/10.1021/jf804005w . [all data]

Soria, Martinez-Castro, et al., 2009
Soria, A.C.; Martinez-Castro, I.; Sanz, J., Study of the precision in the purge-and-trap-gas-chromatography-mass-spectrometry analysis of volatile compounds in honey, J. Chromatogr. A., 2009, 1216, 15, 3300-3304, https://doi.org/10.1016/j.chroma.2009.01.065 . [all data]

Soria, Martinez-Castro, et al., 2008
Soria, A.C.; Martinez-Castro, I.; Sanz, J., Some aspects of dynamic headspace analysis of volatile components in honey, Foog Res. International, 2008, 41, 8, 838-848, https://doi.org/10.1016/j.foodres.2008.07.010 . [all data]

Gonzalez-Rios, Suarez-Quiroz, et al., 2007
Gonzalez-Rios, O.; Suarez-Quiroz, M.L.; Boulanger, R.; Barel, M.; Guyot, B.; Guiraud, J.-P.; Schorr-Galindo, S., Impact of ecological post-harvest processing of coffee aroma: II Roasted coffee., J. Food Composition Analysis, 2007, 20, 3-4, 297-307, https://doi.org/10.1016/j.jfca.2006.12.004 . [all data]

Muresan, Eillebrecht, et al., 2000
Muresan, S.; Eillebrecht, M.A.J.L.; de Rijk, T.C.; de Jonge, H.G.; Leguijt, T.; Nijhuis, H.H., Aroma profile development of intermediate chocolate products. I. Volatile constituents of block-milk, Food Chem., 2000, 68, 2, 167-174, https://doi.org/10.1016/S0308-8146(99)00171-5 . [all data]