Benzoic acid, 2,4-dihydroxy-6-methyl-, methyl ester

Normal alkane RI, non-polar column, temperature ramp

Data compiled by: NIST Mass Spectrometry Data Center, William E. Wallace, director

Column type CapillaryCapillary
Active phase DB-5 MSDB-1
Column length (m) 30.25.
Carrier gas HeliumHe
Substrate
Column diameter (mm) 0.250.25
Phase thickness (μm) 0.250.13
Tstart (C) 70.60.
Tend (C) 290.200.
Heat rate (K/min) 5.4.
Initial hold (min)  2.
Final hold (min) 10.
I 1661.1660.
ReferenceStojanovic, RAdulovic, et al., 2011Rapior, Konska, et al., 2000
Comment MSDC-RI MSDC-RI

References

Stojanovic, RAdulovic, et al., 2011
Stojanovic, I.Z.; RAdulovic, N.S.; Mitrovic, Y.L.J.; Stamenkovic, S.M.; Stojanovic, G.S., Volatile constituents of selected Parmeliaceae lichens, J. Serb. Chem. Soc., 2011, 76, 7, 987-994, https://doi.org/10.2298/JSC101004087S . [all data]

Rapior, Konska, et al., 2000
Rapior, S.; Konska, G.; Guillot, J.; Andary, C.; Bessiere, J.-M., Volatile composition of Laetiporus sulphureus, Cryptogamie, Mycol., 2000, 21, 1, 67-72, https://doi.org/10.1016/S0181-1584(00)00109-3 . [all data]