Cyclobuta[1,2-c:4,3-c']dipyridine

Gas phase ion energetics data

Data compiled as indicated in comments:
LBLHLM - Sharon G. Lias, John E. Bartmess, Joel F. Liebman, John L. Holmes, Rhoda D. Levin, and W. Gary Mallard

Ionization energy determinations

IE (eV) Method Reference Comment
8.3PEYamaguchi, Higashi, et al., 1985LBLHLM
8.40PEYamaguchi, Higashi, et al., 1985Vertical value; LBLHLM

References

Yamaguchi, Higashi, et al., 1985
Yamaguchi, H.; Higashi, M.; MacBride, J.A.H.; Gleiter, R., Photoelectron spectra of diazabiphenylenes, J. Chem. Soc. Faraday Trans. 2, 1985, 81, 1831. [all data]