3,3-dimethylpentanoic acid
- Formula: C7H14O2
- Molecular weight: 130.1849
- IUPAC Standard InChIKey: UPURPFNAFBQPON-UHFFFAOYSA-N
- CAS Registry Number: 3177-74-0
- Chemical structure:

Phase change data

Data compiled by: Thermodynamics Research Center, NIST Boulder Laboratories, Chris Muzny director
Quantity | Value | Units | Method | Reference | Comment |
---|---|---|---|---|---|
Tboil | 477. | K | N/A | Kimura and Tanaka, 1958 | Uncertainty assigned by TRC = 2. K |

References

Kimura and Tanaka, 1958
Kimura, K.; Tanaka, A.,
Anodic Synthesis of Fatty Acids II. The Synthesis of 3,3-Dimethylated Branched Acids,
Chem. Pharm. Bull. (Tokyo) 6, 1958, 9 1958. [all data]