1,3-Pentanediol

Kovats' RI, non-polar column, isothermal

Data compiled by: NIST Mass Spectrometry Data Center, William E. Wallace, director

Column type Packed
Active phase Apiezon L
Column length (m)
Carrier gas
Substrate Celite 545
Column diameter (mm)
Phase thickness (μm)
Temperature (C) 160.
I 847.
ReferenceBogoslovsky, Anvaer, et al., 1978
Comment MSDC-RI

References

Bogoslovsky, Anvaer, et al., 1978
Bogoslovsky, Yu.N.; Anvaer, B.I.; Vigdergauz, M.S., Chromatographic constants in gas chromatography (in Russian), Standards Publ. House, Moscow, 1978, 192. [all data]