1-Propene, 1,1,3-trichloro-2-methyl-

Kovats' RI, non-polar column, isothermal

Data compiled by: NIST Mass Spectrometry Data Center, William E. Wallace, director

Column type Packed
Active phase Squalane
Column length (m) 3.
Carrier gas N2
Substrate Chromosorb W (60-80 mesh)
Column diameter (mm)
Phase thickness (μm)
Temperature (C) 110.
I 921.
ReferenceEngewald, Mai, et al., 1976
Comment MSDC-RI

References

Engewald, Mai, et al., 1976
Engewald, V.W.; Mai, H.; Mühlstädt, M., Gaschromatographische Charakterisierung von Chlorierungs-produkten des Isobutens, J. Prakt. Chem., 1976, 318, 4, 565-574, https://doi.org/10.1002/prac.19763180405 . [all data]