Phosphoramidic acid, N,N-diethyl-, diethyl ester

Gas phase ion energetics data

Data compiled by: Sharon G. Lias, Rhoda D. Levin, and Sherif A. Kafafi

Ionization energy determinations

IE (eV) Method Reference
8.69PEZverev and Villem, 1980
8.69PEZverev, Villem, et al., 1979

References

Zverev and Villem, 1980
Zverev, V.V.; Villem, Y.Y., Ionizationp potentials of phosphoryl compounds, J. Struct. Chem., 1980, 21, 22, In original 30. [all data]

Zverev, Villem, et al., 1979
Zverev, V.V.; Villem, Ya.Ya.; Bel'skii, V.E.; Kitaev, Yu.P., The photoelectronic spectra of phosphoryl compounds, Izv. Akad. Nauk SSSR, Ser. Khim., 1979, 1, 84. [all data]