Pyrazine, 1,4-dihydro-1,4-bis(trimethylsilyl)-

Gas phase ion energetics data

Data compiled as indicated in comments:
LBLHLM - Sharon G. Lias, John E. Bartmess, Joel F. Liebman, John L. Holmes, Rhoda D. Levin, and W. Gary Mallard
LLK - Sharon G. Lias, Rhoda D. Levin, and Sherif A. Kafafi

Ionization energy determinations

IE (eV) Method Reference Comment
6.16PEKaim, 1985Vertical value; LBLHLM
6.16PEKaim, 1981Vertical value; LLK

References

Kaim, 1985
Kaim, W., Electronic structure of 1,4-dihydro-1,2,4,5-tetrazines and of related 1,4-dihydroaromatic compounds, J. Chem. Soc. Perkin Trans. 2, 1985, 1633. [all data]

Kaim, 1981
Kaim, W., Organometal-stabilized 1,4-dihydropyrazines: Extremely electron-rich J. Heterocycl. Chem., Angew. Chem. Int. Ed. Engl., 1981, 20, 600. [all data]