Chromium, tetracarbonylbis(phosphorus trifluoride)-

Gas phase ion energetics data

Data compiled by: Sharon G. Lias, Rhoda D. Levin, and Sherif A. Kafafi

Ionization energy determinations

IE (eV) Method Reference
8.85EIMuller, Fenderl, et al., 1971

References

Muller, Fenderl, et al., 1971
Muller, J.; Fenderl, K.; Mertschenk, B., Die Donor-Akzeptor-Eigenschaften des Liganden Trifluorphosphin in Ubergangsmetallkomplexen, Chem. Ber., 1971, 104, 700. [all data]