Trispiro[2.0.2.0.2.0]nonane

Gas phase thermochemistry data

Data compiled by: Hussein Y. Afeefy, Joel F. Liebman, and Stephen E. Stein

Quantity Value Units Method Reference Comment
Δfgas423.6 ± 4.9kJ/molCcbLuk'yanova, Pimenova, et al., 1993

Condensed phase thermochemistry data

Data compiled by: Hussein Y. Afeefy, Joel F. Liebman, and Stephen E. Stein

Quantity Value Units Method Reference Comment
Δfliquid381.5 ± 4.9kJ/molCcbLuk'yanova, Pimenova, et al., 1993
Quantity Value Units Method Reference Comment
Δcliquid-5638.1 ± 4.8kJ/molCcbLuk'yanova, Pimenova, et al., 1993Corresponding Δfliquid = 381.5 kJ/mol (simple calculation by NIST; no Washburn corrections)

Phase change data

Data compiled as indicated in comments:
DRB - Donald R. Burgess, Jr.
AC - William E. Acree, Jr., James S. Chickos
ALS - Hussein Y. Afeefy, Joel F. Liebman, and Stephen E. Stein

Quantity Value Units Method Reference Comment
Δvap42.1kJ/molN/ALuk'yanova, Pimenova, et al., 1993DRB

Enthalpy of vaporization

ΔvapH (kJ/mol) Temperature (K) Method Reference Comment
59.2 ± 0.5273. - 308.GSBeckhaus, Ruechardt, et al., 1995AC
42.1 ± 0.6303.CLuk'yanova, Pimenova, et al., 1993ALS

Enthalpy of fusion

ΔfusH (kJ/mol) Temperature (K) Method Reference Comment
14.14312.1DSCBeckhaus, Ruechardt, et al., 1995AC

References

Luk'yanova, Pimenova, et al., 1993
Luk'yanova, V.A.; Pimenova, S.M.; Kolesov, V.P.; Kuznetsova, T.S.; Kokoreva, O.V.; Kozhushkov, S.I.; Zefirov, N.S., Enthalpies of formation of some cyclopropane spirohydrocarbons, Russ. J. Phys. Chem. (Engl. Transl.), 1993, 67, 1023-1025, In original 1145. [all data]

Beckhaus, Ruechardt, et al., 1995
Beckhaus, H.-D.; Ruechardt, C.; Kozhushkov, S.I.; Belov, V.N.; Verevkin, S.P.; de Meijere, A., Strain Energies in [n]Triangulanes and Spirocyclopropanated Cyclobutanes: An Experimental Study, J. Am. Chem. Soc., 1995, 117, 48, 11854-11860, https://doi.org/10.1021/ja00153a006 . [all data]