Diphenyl oxalate
- Formula: C14H10O4
- Molecular weight: 242.2268
- IUPAC Standard InChIKey: ULOZDEVJRTYKFE-UHFFFAOYSA-N
- CAS Registry Number: 3155-16-6
- Chemical structure:

Gas phase thermochemistry data

Data compiled by: Hussein Y. Afeefy, Joel F. Liebman, and Stephen E. Stein
Quantity | Value | Units | Method | Reference | Comment |
---|---|---|---|---|---|
ΔfH°gas | -437.2 ± 9.2 | kJ/mol | Ccb | Carson, Fine, et al., 1971 | Hfusion=7.5±0.5 |

Condensed phase thermochemistry data

Data compiled by: Hussein Y. Afeefy, Joel F. Liebman, and Stephen E. Stein
Quantity | Value | Units | Method | Reference | Comment |
---|---|---|---|---|---|
ΔfH°solid | -540. ± 3. | kJ/mol | Ccb | Carson, Fine, et al., 1971 | Hfusion=7.5±0.5 |
Quantity | Value | Units | Method | Reference | Comment |
ΔcH°solid | -6399. ± 3. | kJ/mol | Ccb | Carson, Fine, et al., 1971 | Hfusion=7.5±0.5; Corresponding ΔfHºsolid = -539.7 kJ/mol (simple calculation by NIST; no Washburn corrections) |

Gas phase ion energetics data

Data compiled by: Henry M. Rosenstock, Keith Draxl, Bruce W. Steiner, and John T. Herron
Ionization energy determinations
IE (eV) | Method | Reference |
---|---|---|
7.94 | CTS | Slifkin and Allison, 1967 |

References

Carson, Fine, et al., 1971
Carson, A.S.; Fine, D.H.; Gray, P.; Laye, P.G.,
Standard enthalpies of formation of diphenyl oxalate and benzoic anhydride and some related bond dissociation energies,
J. Chem. Soc. B, 1971, 1611-1615. [all data]
Slifkin and Allison, 1967
Slifkin, M.A.; Allison, A.C.,
Measurement of ionization potentials from contact charge transfer spectra,
Nature, 1967, 215, 949. [all data]