Vanadyl bis(acetylacetonate)

Phase change data

Data compiled by: William E. Acree, Jr., James S. Chickos

Quantity Value Units Method Reference Comment
Δsub140.4 ± 1.1kJ/molCJamea and Pilcher, 1986

Enthalpy of sublimation

ΔsubH (kJ/mol) Temperature (K) Method Reference Comment
140.7 ± 4.0493.DSCMurray and Hill, 1987
91.5430.5AStephenson and Malanowski, 1987Based on data from 418. - 443. K.
192.4461.CJamea and Pilcher, 1986

References

Jamea and Pilcher, 1986
Jamea, E.H.; Pilcher, G., Standard enthalpies of formation of the pentane-2,4-dionate and 8-hydroxyquinolate complexes of vanadium(III) and of oxovanadium(IV) by solution-reaction calorimetry, Thermochimica Acta, 1986, 97, 77-84, https://doi.org/10.1016/0040-6031(86)87009-5 . [all data]

Murray and Hill, 1987
Murray, J.P.; Hill, J.O., DSC determination of the sublimation enthalpy of bis(2,4-pentanedionato)oxovanadium(IV) and tetrakis(2,4-pentanedionato)zirconium(IV), Thermochimica Acta, 1987, 109, 2, 391-396, https://doi.org/10.1016/0040-6031(87)80035-7 . [all data]

Stephenson and Malanowski, 1987
Stephenson, Richard M.; Malanowski, Stanislaw, Handbook of the Thermodynamics of Organic Compounds, 1987, https://doi.org/10.1007/978-94-009-3173-2 . [all data]