1.2-diacetylhydrazine

Phase change data

Data compiled by: William E. Acree, Jr., James S. Chickos

Enthalpy of sublimation

ΔsubH (kcal/mol) Temperature (K) Method Reference Comment
24.64 ± 0.41352.5AStephenson and Malanowski, 1987Based on data from 347. - 358. K. See also Takagi, Shintani, et al., 1959.

References

Stephenson and Malanowski, 1987
Stephenson, Richard M.; Malanowski, Stanislaw, Handbook of the Thermodynamics of Organic Compounds, 1987, https://doi.org/10.1007/978-94-009-3173-2 . [all data]

Takagi, Shintani, et al., 1959
Takagi, Sadao; Shintani, Ryuichi; Chihara, Hideaki; Seki, Syûzô, Vapor Pressures of Molecular Crystals. XIV. Sulfamide and Diacetylhydrazine, Bull. Chem. Soc. Jpn., 1959, 32, 2, 137-142, https://doi.org/10.1246/bcsj.32.137 . [all data]