Glycine, N-(N-L-alanylglycyl)-

Gas phase ion energetics data

Data evaluated as indicated in comments:
HL - Edward P. Hunter and Sharon G. Lias

Data compiled as indicated in comments:
MM - Michael M. Meot-Ner (Mautner)

Quantity Value Units Method Reference Comment
Gas basicity917.8kJ/molN/AHunter and Lias, 1998HL

Gas basicity at 298K

Gas basicity (review) (kJ/mol) Reference Comment
900.1 ± 2.4Bouchoux and Salpin, 2003T = 298K; MM

References

Hunter and Lias, 1998
Hunter, E.P.; Lias, S.G., Evaluated Gas Phase Basicities and Proton Affinities of Molecules: An Update, J. Phys. Chem. Ref. Data, 1998, 27, 3, 413-656, https://doi.org/10.1063/1.556018 . [all data]

Bouchoux and Salpin, 2003
Bouchoux, G.; Salpin, J.Y., Gas-phase basicity of glycine, alanine, proline, serine, lysine, histidine and some of their peptides by the thermokinetic method, European J. Mass Spectrometry, 2003, 9, 391-402. [all data]