3-Hydroxy-2-pentanone

Van Den Dool and Kratz RI, polar column, temperature ramp

Data compiled by: NIST Mass Spectrometry Data Center, William E. Wallace, director

Column type CapillaryCapillaryCapillary
Active phase StabilwaxDB-WaxDB-FFAP
Column length (m) 30.30.30.
Carrier gas N2HeH2
Substrate
Column diameter (mm) 0.320.250.32
Phase thickness (μm) 1.0.250.25
Tstart (C) 40.40.40.
Tend (C) 230.220.240.
Heat rate (K/min) 4.5.5.
Initial hold (min) 2.5.2.
Final hold (min) 10.5.
I 1338.1344.1338.
ReferenceFang and Qian, 2005Kurniadi, Rhlid, et al., 2003Charles, Martin, et al., 2000
Comment MSDC-RI MSDC-RI MSDC-RI

Van Den Dool and Kratz RI, non-polar column, custom temperature program

Data compiled by: NIST Mass Spectrometry Data Center, William E. Wallace, director

Column type CapillaryCapillary
Active phase CP-Sil 8CB-MSBPX-5
Column length (m) 60.50.
Carrier gas HeHe
Substrate
Column diameter (mm) 0.250.32
Phase thickness (μm) 0.250.5
Program 0C(5min) => 40C/min => 40C (2min) => 4C/min => 280C0C(5min) => 40C/min => 40C(2min) => 4C/min => 280C
I 815.838.
ReferenceElmore, Mottram, et al., 2000Elmore, Mottram, et al., 1999
Comment MSDC-RI MSDC-RI

Normal alkane RI, non-polar column, temperature ramp

Data compiled by: NIST Mass Spectrometry Data Center, William E. Wallace, director

Column type Capillary
Active phase DB-1
Column length (m) 60.
Carrier gas He
Substrate
Column diameter (mm) 0.25
Phase thickness (μm) 1.
Tstart (C) 40.
Tend (C) 260.
Heat rate (K/min) 2.
Initial hold (min) 5.
Final hold (min) 60.
I 783.
ReferenceYu and Ho, 1995
Comment MSDC-RI

Normal alkane RI, polar column, custom temperature program

Data compiled by: NIST Mass Spectrometry Data Center, William E. Wallace, director

Column type Capillary
Active phase DB-Wax
Column length (m) 60.
Carrier gas Helium
Substrate
Column diameter (mm) 0.25
Phase thickness (μm) 0.25
Program 60 0C (3 min) 2 0C/min -> 150 0C 4 0C/min -> 200 0C
I 1338.
ReferenceKim. J.H., Ahn, et al., 2004
Comment MSDC-RI

Kovats' RI, polar column, temperature ramp

Data compiled by: NIST Mass Spectrometry Data Center, William E. Wallace, director

Column type Capillary
Active phase Carbowax 20M
Column length (m) 50.
Carrier gas He
Substrate
Column diameter (mm) 0.28
Phase thickness (μm)
Tstart (C) 70.
Tend (C) 190.
Heat rate (K/min) 2.
Initial hold (min)
Final hold (min)
I 1345.
ReferenceTressl, Friese, et al., 1978
Comment MSDC-RI

Normal alkane RI, non-polar column, custom temperature program

Data compiled by: NIST Mass Spectrometry Data Center, William E. Wallace, director

Column type Capillary
Active phase SPB-1
Column length (m) 30.
Carrier gas Helium
Substrate
Column diameter (mm) 0.25
Phase thickness (μm) 0.25
Program 35 0C (2 min) 1 0C/min -> 90 0C 3 0C/min -> 220 0C
I 768.
ReferenceBorse, Rao, et al., 2007
Comment MSDC-RI

References

Fang and Qian, 2005
Fang, Y.; Qian, M., Aroma compounds in Oregon Pinot Noir wine determined by aroma extract dilution analysis (AEDA), Flavour Fragr. J., 2005, 20, 1, 22-29, https://doi.org/10.1002/ffj.1551 . [all data]

Kurniadi, Rhlid, et al., 2003
Kurniadi, T.; Rhlid, R.B.; Fay, L.-B.; Juillerat, M.-A.; Berger, R.G., Chemoenzymatic synthesis of aroma active 5,6-dihydro- and tetrahydropyrazines from aliphatic acyloins produced by Baker's yeast, J. Agric. Food Chem., 2003, 51, 10, 3103-3107, https://doi.org/10.1021/jf0261809 . [all data]

Charles, Martin, et al., 2000
Charles, M.; Martin, B.; Ginies, C.; Etievant, P.; Coste, G.; Guichard, E., Potent aroma compounds of two red wine vinegars, J. Agric. Food Chem., 2000, 48, 1, 70-77, https://doi.org/10.1021/jf9905424 . [all data]