Benzene, 1-ethyl-3,4,5-trimethyl

Kovats' RI, non-polar column, isothermal

Data compiled by: NIST Mass Spectrometry Data Center, William E. Wallace, director

Column type CapillaryCapillaryCapillary
Active phase OV-101OV-101OV-101
Column length (m) 50.278.278.
Carrier gas HeH2H2
Substrate
Column diameter (mm) 0.200.250.25
Phase thickness (μm)
Temperature (C) 100.100.100.
I 1193.1193.1193.
ReferenceMatisová, Kovacicová, et al., 1989Matisová, Rukríglová, et al., 1988Matisová, Rukríglová, et al., 1988
Comment MSDC-RI MSDC-RI MSDC-RI

References

Matisová, Kovacicová, et al., 1989
Matisová, E.; Kovacicová, E.; Ha, P.T.; Kolek, E.; Engewald, W., Identification of alkylbenzenes up to C12 by capillary gas chromatography-mass spectrometry. II. Retention indices on OV-101 columns and retention-molecular structure correlations, J. Chromatogr., 1989, 475, 2, 113-123, https://doi.org/10.1016/S0021-9673(01)89667-9 . [all data]

Matisová, Rukríglová, et al., 1988
Matisová, E.; Rukríglová, M.; Krupcík, J.; Kovacicová, E.; Holotík, S., Identification of alkylbenzenes up to C12 by capillary gas chromatography and combined gas chromatography-mass spectrometry. I. OV-101 as stationary phase, J. Chromatogr., 1988, 455, 301-309, https://doi.org/10.1016/S0021-9673(01)82129-4 . [all data]