4-(4-Pentenyloxy)phenyl 5-cyano-2-thiophene carboxylate

Phase change data

Data compiled by: William E. Acree, Jr., James S. Chickos

Enthalpy of fusion

ΔfusH (kJ/mol) Temperature (K) Method Reference
72.8337.6DSCWu, Wang, et al., 2000

References

Wu, Wang, et al., 2000
Wu, Long-Hai; Wang, Yen-Chih; Hsu, Chain-Shu, Synthesis and characterization of thiophene-containing liquid crystals, Liquid Crystals, 2000, 27, 11, 1503-1513, https://doi.org/10.1080/026782900750018672 . [all data]