[2.2]-Paracyclophane-1-ene

Phase change data

Data compiled by: William E. Acree, Jr., James S. Chickos

Quantity Value Units Method Reference Comment
Δsub94.4 ± 1.1kJ/molGSde Meijere, Kozhushkov, et al., 2003Based on data from 318. - 343. K.

Enthalpy of sublimation

ΔsubH (kJ/mol) Temperature (K) Method Reference Comment
93.3 ± 1.1331.GSde Meijere, Kozhushkov, et al., 2003Based on data from 318. - 343. K.

Enthalpy of fusion

ΔfusH (kJ/mol) Temperature (K) Reference
17.61469.9de Meijere, Kozhushkov, et al., 2003

References

de Meijere, Kozhushkov, et al., 2003
de Meijere, Armin; Kozhushkov, Sergei I.; Rauch, Karsten; Schill, Heiko; Verevkin, Sergey P.; Kümmerlin, Martin; Beckhaus, Hans-Dieter; Rüchardt, Christoph; Yufit, Dmitrii S., Heats of Formation of [2.2]Paracyclophane-1-ene and [2.2]Paracyclophane-1,9-diene - An Experimental Study, J. Am. Chem. Soc., 2003, 125, 49, 15110-15113, https://doi.org/10.1021/ja0374628 . [all data]