Poly- -butyrolactone

Phase change data

Data compiled by: Eugene S. Domalski and Elizabeth D. Hearing

Enthalpy of fusion

ΔfusH (kcal/mol) Temperature (K) Reference Comment
3.1549337.5Yevstropov, Lebedev, et al., 1980100% crystallinity.

Entropy of fusion

ΔfusS (cal/mol*K) Temperature (K) Reference Comment
9.42337.5Yevstropov, Lebedev, et al., 1980100%

References

Yevstropov, Lebedev, et al., 1980
Yevstropov, A.A.; Lebedev, B.V.; Kiparisova, Ye.G.; Alekseyev, V.A.; Stashina, G.A., Thermodynamic parameters of transformation of t-butyrolactone into poly-t-butyrolactone at normal pressure in the range of 0 to 400 K, Vysokomol. Soedin, Ser., 1980, A 22(11), 2450-2456. [all data]