Benzene, [(methylsulfonyl)methyl]-

Gas phase thermochemistry data

Data compiled by: Hussein Y. Afeefy, Joel F. Liebman, and Stephen E. Stein

Quantity Value Units Method Reference Comment
Δfgas-272. ± 4.kJ/molCcrBusfield, Mackle, et al., 1961Heat of combustion corrected for constant pressure
Δfgas-285. ± 4.2kJ/molCcrMackle and O'Hare, 1961Hfusion=2.0±0.9 kcal/mol,see Busfield, Mackle, et al., 1961

Condensed phase thermochemistry data

Data compiled by: Hussein Y. Afeefy, Joel F. Liebman, and Stephen E. Stein

Quantity Value Units Method Reference Comment
Δfsolid-371. ± 2.kJ/molCcrBusfield, Mackle, et al., 1961Heat of combustion corrected for constant pressure
Δfsolid-374. ± 1.kJ/molCcrMackle and O'Hare, 1961Hfusion=2.0±0.9 kcal/mol,see Busfield, Mackle, et al., 1961
Quantity Value Units Method Reference Comment
Δcsolid-4808.3 ± 3.0kJ/molCcrBusfield, Mackle, et al., 1961Heat of combustion corrected for constant pressure

References

Busfield, Mackle, et al., 1961
Busfield, W.K.; Mackle, H.; O'Hare, P.A.G., Studies in the thermochemistry of sulphones. Part 2 - The standard heats of formation of sulphones of the type RSO2CH3, Trans. Faraday Soc., 1961, 57, 1054-1057. [all data]

Mackle and O'Hare, 1961
Mackle, H.; O'Hare, P.A.G., Studies in the thermochemistry of sulphones. Part 6 - Heats of combustion, fusion, vaporization and atomization of six aromatic and two allylic sulphones, Trans. Faraday Soc., 1961, 57, 1521-1526. [all data]