Tetracyclo[3.3.1.0(2,8).0(4,6)]nonane

Gas phase ion energetics data

Data compiled as indicated in comments:
LLK - Sharon G. Lias, Rhoda D. Levin, and Sherif A. Kafafi

Ionization energy determinations

IE (eV) Method Reference Comment
8.2PEHaselbach, Heilbronner, et al., 1972LLK
8.67PEHaselbach, Heilbronner, et al., 1972Vertical value; LLK

References

Haselbach, Heilbronner, et al., 1972
Haselbach, E.; Heilbronner, E.; Musso, H.; Schmelzer, A., Notiz uber die Photoelektronen-Spektren des Nortricyclens und des Triasterans, Helv. Chim. Acta, 1972, 55, 302. [all data]