7-Ethoxycoumarin

Kovats' RI, non-polar column, isothermal

View large format table.

Column type Active phase Temperature (C) I Reference Comment
CapillaryLM-1170.1754.Soares, Monache, et al., 199925. m/0.25 mm/0.25 μm, H2
CapillaryLM-1190.1771.Soares, Monache, et al., 199925. m/0.25 mm/0.25 μm, H2
CapillaryLM-1210.1779.Soares, Monache, et al., 199925. m/0.25 mm/0.25 μm, H2
CapillaryCBP-5170.1815.Soares, Monache, et al., 199925. m/0.25 mm/0.22 μm, H2
CapillaryCBP-5190.1829.Soares, Monache, et al., 199925. m/0.25 mm/0.22 μm, H2

References

Soares, Monache, et al., 1999
Soares, M.F.; Monache, F.D.; Heinzen, V.E.F.; Yunes, R.A., Prediction of gas chromatographic retention indices of coumarins, J. Braz. Chem. Soc., 1999, 10, 3, 189-196, https://doi.org/10.1590/S0103-50531999000300006 . [all data]